BDBM46887 MLS000557320::N,N-Diethyl-2-[2-isopropyl-4-(2-methoxy-phenyl)-tetrahydro-pyran-4-yl]-acetamide::N,N-diethyl-2-[2-isopropyl-4-(2-methoxyphenyl)tetrahydropyran-4-yl]acetamide::N,N-diethyl-2-[4-(2-methoxyphenyl)-2-propan-2-yl-4-oxanyl]acetamide::N,N-diethyl-2-[4-(2-methoxyphenyl)-2-propan-2-yl-oxan-4-yl]ethanamide::N,N-diethyl-2-[4-(2-methoxyphenyl)-2-propan-2-yloxan-4-yl]acetamide::SMR000148237::cid_3758231
SMILES CCN(CC)C(=O)CC1(CCOC(C1)C(C)C)c1ccccc1OC
InChI Key InChIKey=KAOXPSMRKDCCFS-UHFFFAOYSA-N
Data  2 EC50
  Tab Delimited (TSV)   2D SDfile   Computed 3D by Vconf -m prep SDfile
Find this compound or compounds like it in BindingDB:
Activity Spreadsheet -- Enzyme Inhibition Constant Data from BindingDB
Found 2 hits for monomerid = 46887
TargetIon channel NompC(Danio rerio)
The Scripps Research Institute Molecular Screening Center
Curated by PubChem BioAssay
LigandPNGBDBM46887(MLS000557320 | N,N-Diethyl-2-[2-isopropyl-4-(2-met...)
Affinity DataEC50:  2.99E+4nM. Assay description: Source (MLPCN Center Name): The Scripps Research Institute Molecular Screening Center (SRIMSC) Center Affiliation: The Scripps Research Institute (TS...
In DepthDetails PCBioAssay
TargetMucolipin-3(Homo sapiens (Human))
The Scripps Research Institute Molecular Screening Center
Curated by PubChem BioAssay
LigandPNGBDBM46887(MLS000557320 | N,N-Diethyl-2-[2-isopropyl-4-(2-met...)
Affinity DataEC50:  6.96E+3nM. Assay description: Source (MLPCN Center Name): The Scripps Research Institute Molecular Screening Center (SRIMSC) Center Affiliation: The Scripps Research Institute (TS...
In DepthDetails PCBioAssay