BDBM47135 US8952157, 297
SMILES CC1(C)CC(C(CN2CCN(CC2)c2ccc(C(=O)NS(=O)(=O)c3ccc(OCC4(F)CCOCC4)c(c3)[N+]([O-])=O)c(Oc3cc4cc[nH]c4cc3F)c2)CO1)c1ccc(Cl)cc1
InChI Key
Data  1 KI
  Tab Delimited (TSV)   2D SDfile   Computed 3D by Vconf -m prep SDfile
Find this compound or compounds like it in BindingDB:
Activity Spreadsheet -- Enzyme Inhibition Constant Data from BindingDB
Found 1 hit for monomerid = 47135
TargetApoptosis regulator Bcl-2(Homo sapiens (Human))
Abbvie
US Patent
LigandPNGBDBM47135(US8952157, 297)
Affinity DataKi: <0.0100nM ΔG°: <-15.0kcal/moleT: 2°C. Assay description: Representative compounds were serially diluted in dimethyl sulfoxide (DMSO) starting at 50 uM (2x starting concentration; 10% DMSO) and 10 uL were tr...
In DepthDetails US Patent