BDBM473171 (3R,4S)-3-((4-amino-3-(4-phenoxyphenyl)-1H-pyrazolo[3,4-d]pyrimidin-1-yl)methyl)-1,2-dithiolan-4-ol::US10844038, Example 43 B.
SMILES Nc1ncnc2n(C[C@H]3SSC[C@@H]3O)nc(-c3ccc(Oc4ccccc4)cc3)c12
InChI Key InChIKey=UORAPQCBWYIISR-DLBZAZTESA-N
Data  28 IC50  2 Kd
  Tab Delimited (TSV)   2D SDfile   Computed 3D by Vconf -m prep SDfile
Find this compound or compounds like it in BindingDB:
Activity Spreadsheet -- Enzyme Inhibition Constant Data from BindingDB
Found 30 hits for monomerid = 473171
TargetProto-oncogene tyrosine-protein kinase Src(Homo sapiens (Human))
Sabila Biosciences
US Patent
LigandPNGBDBM473171((3R,4S)-3-((4-amino-3-(4-phenoxyphenyl)-1H-pyrazol...)
Affinity DataIC50:  750nM. Assay description: IC50: Methods for In Vitro Evaluation Assays known in the art for testing compounds are used to test compounds of this invention and to assess the bi...
Ligand InfoPC cidPC sid
In DepthDetails US Patent
TargetDual specificity mitogen-activated protein kinase kinase 5(Homo sapiens (Human))
Sabila Biosciences
US Patent
LigandPNGBDBM473171((3R,4S)-3-((4-amino-3-(4-phenoxyphenyl)-1H-pyrazol...)
Affinity DataIC50:  5.50E+3nM. Assay description: IC50 Table 13-20: The protocol calls for test compound of the invention to be incubated with kinase, substrate, cofactors, and radio-isotope-labeled ...
Ligand InfoPC cidPC sid
In DepthDetails US Patent
TargetTyrosine-protein kinase Fgr(Homo sapiens (Human))
Sabila Biosciences
US Patent
LigandPNGBDBM473171((3R,4S)-3-((4-amino-3-(4-phenoxyphenyl)-1H-pyrazol...)
Affinity DataIC50:  750nM. Assay description: IC50 Table 13-20: The protocol calls for test compound of the invention to be incubated with kinase, substrate, cofactors, and radio-isotope-labeled ...
Ligand InfoPC cidPC sid
In DepthDetails US Patent
TargetTyrosine-protein kinase Yes(Homo sapiens (Human))
Sabila Biosciences
US Patent
LigandPNGBDBM473171((3R,4S)-3-((4-amino-3-(4-phenoxyphenyl)-1H-pyrazol...)
Affinity DataIC50:  750nM. Assay description: IC50: Methods for In Vitro Evaluation Assays known in the art for testing compounds are used to test compounds of this invention and to assess the bi...
Ligand InfoPC cidPC sid
In DepthDetails US Patent
TargetTyrosine-protein kinase Lck(Homo sapiens (Human))
Sabila Biosciences
US Patent
LigandPNGBDBM473171((3R,4S)-3-((4-amino-3-(4-phenoxyphenyl)-1H-pyrazol...)
Affinity DataIC50:  750nM. Assay description: IC50: Methods for In Vitro Evaluation Assays known in the art for testing compounds are used to test compounds of this invention and to assess the bi...
Ligand InfoPC cidPC sid
In DepthDetails US Patent
TargetTyrosine-protein kinase HCK(Homo sapiens (Human))
Sabila Biosciences
US Patent
LigandPNGBDBM473171((3R,4S)-3-((4-amino-3-(4-phenoxyphenyl)-1H-pyrazol...)
Affinity DataIC50:  750nM. Assay description: IC50: Methods for In Vitro Evaluation Assays known in the art for testing compounds are used to test compounds of this invention and to assess the bi...
Ligand InfoPC cidPC sid
In DepthDetails US Patent
TargetTyrosine-protein kinase BTK(Homo sapiens (Human))
Sabila Biosciences
US Patent
LigandPNGBDBM473171((3R,4S)-3-((4-amino-3-(4-phenoxyphenyl)-1H-pyrazol...)
Affinity DataIC50:  750nM. Assay description: IC50: Methods for In Vitro Evaluation Assays known in the art for testing compounds are used to test compounds of this invention and to assess the bi...
Ligand InfoPC cidPC sid
In DepthDetails US Patent
TargetDual specificity mitogen-activated protein kinase kinase 1(Homo sapiens (Human))
Sabila Biosciences
US Patent
LigandPNGBDBM473171((3R,4S)-3-((4-amino-3-(4-phenoxyphenyl)-1H-pyrazol...)
Affinity DataKd:  52nM. Assay description: Kd: For most assays, kinase-tagged T7 phage strains were prepared in an E. coli host derived from the BL21 strain. E. coli were grown to log-phase an...
Ligand InfoPC cidPC sid
In DepthDetails US Patent
TargetDual specificity mitogen-activated protein kinase kinase 5(Homo sapiens (Human))
Sabila Biosciences
US Patent
LigandPNGBDBM473171((3R,4S)-3-((4-amino-3-(4-phenoxyphenyl)-1H-pyrazol...)
Affinity DataKd: <5nM. Assay description: Kd: For most assays, kinase-tagged T7 phage strains were prepared in an E. coli host derived from the BL21 strain. E. coli were grown to log-phase an...
Ligand InfoPC cidPC sid
In DepthDetails US Patent
TargetProto-oncogene tyrosine-protein kinase Src(Homo sapiens (Human))
Sabila Biosciences
US Patent
LigandPNGBDBM473171((3R,4S)-3-((4-amino-3-(4-phenoxyphenyl)-1H-pyrazol...)
Affinity DataIC50:  52nM. Assay description: IC50: Methods for In Vitro Evaluation Assays known in the art for testing compounds are used to test compounds of this invention and to assess the bi...
Ligand InfoPC cidPC sid
In DepthDetails US Patent
TargetTyrosine-protein kinase Yes(Homo sapiens (Human))
Sabila Biosciences
US Patent
LigandPNGBDBM473171((3R,4S)-3-((4-amino-3-(4-phenoxyphenyl)-1H-pyrazol...)
Affinity DataIC50: <5nM. Assay description: IC50: Methods for In Vitro Evaluation Assays known in the art for testing compounds are used to test compounds of this invention and to assess the bi...
Ligand InfoPC cidPC sid
In DepthDetails US Patent
TargetTyrosine-protein kinase Fgr(Homo sapiens (Human))
Sabila Biosciences
US Patent
LigandPNGBDBM473171((3R,4S)-3-((4-amino-3-(4-phenoxyphenyl)-1H-pyrazol...)
Affinity DataIC50: <5nM. Assay description: IC50 Table 13-20: The protocol calls for test compound of the invention to be incubated with kinase, substrate, cofactors, and radio-isotope-labeled ...
Ligand InfoPC cidPC sid
In DepthDetails US Patent
TargetTyrosine-protein kinase Fyn(Homo sapiens (Human))
Sabila Biosciences
US Patent
LigandPNGBDBM473171((3R,4S)-3-((4-amino-3-(4-phenoxyphenyl)-1H-pyrazol...)
Affinity DataIC50: <5nM. Assay description: IC50 Table 13-20: The protocol calls for test compound of the invention to be incubated with kinase, substrate, cofactors, and radio-isotope-labeled ...
Ligand InfoPC cidPC sid
In DepthDetails US Patent
TargetTyrosine-protein kinase Blk(Homo sapiens (Human))
Sabila Biosciences
US Patent
LigandPNGBDBM473171((3R,4S)-3-((4-amino-3-(4-phenoxyphenyl)-1H-pyrazol...)
Affinity DataIC50:  52nM. Assay description: IC50 Table 13-20: The protocol calls for test compound of the invention to be incubated with kinase, substrate, cofactors, and radio-isotope-labeled ...
Ligand InfoPC cidPC sid
In DepthDetails US Patent
TargetTyrosine-protein kinase Lck(Homo sapiens (Human))
Sabila Biosciences
US Patent
LigandPNGBDBM473171((3R,4S)-3-((4-amino-3-(4-phenoxyphenyl)-1H-pyrazol...)
Affinity DataIC50: <5nM. Assay description: IC50: Methods for In Vitro Evaluation Assays known in the art for testing compounds are used to test compounds of this invention and to assess the bi...
Ligand InfoPC cidPC sid
In DepthDetails US Patent
TargetTyrosine-protein kinase HCK(Homo sapiens (Human))
Sabila Biosciences
US Patent
LigandPNGBDBM473171((3R,4S)-3-((4-amino-3-(4-phenoxyphenyl)-1H-pyrazol...)
Affinity DataIC50: <5nM. Assay description: IC50: Methods for In Vitro Evaluation Assays known in the art for testing compounds are used to test compounds of this invention and to assess the bi...
Ligand InfoPC cidPC sid
In DepthDetails US Patent
TargetTyrosine-protein kinase Lyn(Homo sapiens (Human))
Sabila Biosciences
US Patent
LigandPNGBDBM473171((3R,4S)-3-((4-amino-3-(4-phenoxyphenyl)-1H-pyrazol...)
Affinity DataIC50:  52nM. Assay description: IC50 Table 13-20: The protocol calls for test compound of the invention to be incubated with kinase, substrate, cofactors, and radio-isotope-labeled ...
Ligand InfoPC cidPC sid
In DepthDetails US Patent
TargetTyrosine-protein kinase CSK(Homo sapiens (Human))
Sabila Biosciences
US Patent
LigandPNGBDBM473171((3R,4S)-3-((4-amino-3-(4-phenoxyphenyl)-1H-pyrazol...)
Affinity DataIC50:  52nM. Assay description: IC50 Table 13-20: The protocol calls for test compound of the invention to be incubated with kinase, substrate, cofactors, and radio-isotope-labeled ...
Ligand InfoPC cidPC sid
In DepthDetails US Patent
TargetTyrosine-protein kinase Fyn [Y531F](Homo sapiens (Human))
Sabila Biosciences
US Patent
LigandPNGBDBM473171((3R,4S)-3-((4-amino-3-(4-phenoxyphenyl)-1H-pyrazol...)
Affinity DataIC50:  750nM. Assay description: IC50 Table 13-20: The protocol calls for test compound of the invention to be incubated with kinase, substrate, cofactors, and radio-isotope-labeled ...
Ligand InfoPC cidPC sid
In DepthDetails US Patent
TargetTyrosine-protein kinase BTK(Homo sapiens (Human))
Sabila Biosciences
US Patent
LigandPNGBDBM473171((3R,4S)-3-((4-amino-3-(4-phenoxyphenyl)-1H-pyrazol...)
Affinity DataIC50:  52nM. Assay description: IC50: Methods for In Vitro Evaluation Assays known in the art for testing compounds are used to test compounds of this invention and to assess the bi...
Ligand InfoPC cidPC sid
In DepthDetails US Patent
TargetCytoplasmic tyrosine-protein kinase BMX(Homo sapiens (Human))
Sabila Biosciences
US Patent
LigandPNGBDBM473171((3R,4S)-3-((4-amino-3-(4-phenoxyphenyl)-1H-pyrazol...)
Affinity DataIC50:  52nM. Assay description: IC50 Table 13-20: The protocol calls for test compound of the invention to be incubated with kinase, substrate, cofactors, and radio-isotope-labeled ...
Ligand InfoPC cidPC sid
In DepthDetails US Patent
TargetTyrosine-protein kinase ITK/TSK(Homo sapiens (Human))
Sabila Biosciences
US Patent
LigandPNGBDBM473171((3R,4S)-3-((4-amino-3-(4-phenoxyphenyl)-1H-pyrazol...)
Affinity DataIC50:  5.50E+3nM. Assay description: IC50 Table 13-20: The protocol calls for test compound of the invention to be incubated with kinase, substrate, cofactors, and radio-isotope-labeled ...
Ligand InfoPC cidPC sid
In DepthDetails US Patent
TargetReceptor-type tyrosine-protein kinase FLT3(Homo sapiens (Human))
Sabila Biosciences
US Patent
LigandPNGBDBM473171((3R,4S)-3-((4-amino-3-(4-phenoxyphenyl)-1H-pyrazol...)
Affinity DataIC50:  750nM. Assay description: IC50 Table 13-20: The protocol calls for test compound of the invention to be incubated with kinase, substrate, cofactors, and radio-isotope-labeled ...
Ligand InfoPC cidPC sid
In DepthDetails US Patent
TargetDimer of Receptor-type tyrosine-protein kinase FLT3(Homo sapiens (Human))
Sabila Biosciences
US Patent
LigandPNGBDBM473171((3R,4S)-3-((4-amino-3-(4-phenoxyphenyl)-1H-pyrazol...)
Affinity DataIC50:  750nM. Assay description: IC50 Table 13-20: The protocol calls for test compound of the invention to be incubated with kinase, substrate, cofactors, and radio-isotope-labeled ...
Ligand InfoPC cidPC sid
In DepthDetails US Patent
TargetProtein-tyrosine kinase 6(Homo sapiens (Human))
Sabila Biosciences
US Patent
LigandPNGBDBM473171((3R,4S)-3-((4-amino-3-(4-phenoxyphenyl)-1H-pyrazol...)
Affinity DataIC50:  52nM. Assay description: IC50 Table 13-20: The protocol calls for test compound of the invention to be incubated with kinase, substrate, cofactors, and radio-isotope-labeled ...
Ligand InfoPC cidPC sid
In DepthDetails US Patent
TargetTyrosine-protein kinase FRK(Homo sapiens (Human))
Sabila Biosciences
US Patent
LigandPNGBDBM473171((3R,4S)-3-((4-amino-3-(4-phenoxyphenyl)-1H-pyrazol...)
Affinity DataIC50:  52nM. Assay description: IC50 Table 13-20: The protocol calls for test compound of the invention to be incubated with kinase, substrate, cofactors, and radio-isotope-labeled ...
Ligand InfoPC cidPC sid
In DepthDetails US Patent
TargetTyrosine-protein kinase Fyn(Homo sapiens (Human))
Sabila Biosciences
US Patent
LigandPNGBDBM473171((3R,4S)-3-((4-amino-3-(4-phenoxyphenyl)-1H-pyrazol...)
Affinity DataIC50:  52nM. Assay description: IC50 Table 21: This assay is based on a competitive binder which can interact with a latent pocket formed only in the inactive state of the kinase. A...
Ligand InfoPC cidPC sid
In DepthDetails US Patent
TargetIsoform 2 of Tyrosine-protein kinase Fyn (T)(Homo sapiens (Human))
Sabila Biosciences
US Patent
LigandPNGBDBM473171((3R,4S)-3-((4-amino-3-(4-phenoxyphenyl)-1H-pyrazol...)
Affinity DataIC50:  52nM. Assay description: IC50 Table 22: This assay referred to as FlashPlate-based Protein Kinase Assay uses recombinant protein kinase and ATP concentration corresponding to...
Ligand InfoPC cidPC sid
In DepthDetails US Patent
TargetTyrosine-protein kinase Yes(Homo sapiens (Human))
Sabila Biosciences
US Patent
LigandPNGBDBM473171((3R,4S)-3-((4-amino-3-(4-phenoxyphenyl)-1H-pyrazol...)
Affinity DataIC50: <5nM. Assay description: IC50: Methods for In Vitro Evaluation Assays known in the art for testing compounds are used to test compounds of this invention and to assess the bi...
Ligand InfoPC cidPC sid
In DepthDetails US Patent
TargetTyrosine-protein kinase Blk(Homo sapiens (Human))
Sabila Biosciences
US Patent
LigandPNGBDBM473171((3R,4S)-3-((4-amino-3-(4-phenoxyphenyl)-1H-pyrazol...)
Affinity DataIC50:  750nM. Assay description: IC50 Table 13-20: The protocol calls for test compound of the invention to be incubated with kinase, substrate, cofactors, and radio-isotope-labeled ...
Ligand InfoPC cidPC sid
In DepthDetails US Patent