BDBM473175 (3S,4S)-3-((4-amino-3-(4-phenoxyphenyl)-1H-pyrazolo[3,4-d]pyrimidin-1-yl)methyl)-1,2-dithiolan-4-ol::US10844038, Example 46 A.
SMILES Nc1ncnc2n(C[C@@H]3SSC[C@@H]3O)nc(-c3ccc(Oc4ccccc4)cc3)c12
InChI Key InChIKey=UORAPQCBWYIISR-IRXDYDNUSA-N
Data  17 IC50  5 Kd
  Tab Delimited (TSV)   2D SDfile   Computed 3D by Vconf -m prep SDfile
Find this compound or compounds like it in BindingDB:
Activity Spreadsheet -- Enzyme Inhibition Constant Data from BindingDB
Found 22 hits for monomerid = 473175
TargetTyrosine-protein kinase BTK(Homo sapiens (Human))
Sabila Biosciences
US Patent
LigandPNGBDBM473175((3S,4S)-3-((4-amino-3-(4-phenoxyphenyl)-1H-pyrazol...)
Affinity DataIC50:  5.50E+3nM. Assay description: IC50: Methods for In Vitro Evaluation Assays known in the art for testing compounds are used to test compounds of this invention and to assess the bi...
Ligand InfoPC cidPC sid
In DepthDetails US Patent
TargetReceptor tyrosine-protein kinase erbB-4(Homo sapiens (Human))
Sabila Biosciences
US Patent
LigandPNGBDBM473175((3S,4S)-3-((4-amino-3-(4-phenoxyphenyl)-1H-pyrazol...)
Affinity DataIC50:  5.50E+3nM. Assay description: IC50 Table 13-20: The protocol calls for test compound of the invention to be incubated with kinase, substrate, cofactors, and radio-isotope-labeled ...
Ligand InfoPC cidPC sid
In DepthDetails US Patent
TargetDual specificity mitogen-activated protein kinase kinase 1(Homo sapiens (Human))
Sabila Biosciences
US Patent
LigandPNGBDBM473175((3S,4S)-3-((4-amino-3-(4-phenoxyphenyl)-1H-pyrazol...)
Affinity DataKd:  750nM. Assay description: Kd: For most assays, kinase-tagged T7 phage strains were prepared in an E. coli host derived from the BL21 strain. E. coli were grown to log-phase an...
Ligand InfoPC cidPC sid
In DepthDetails US Patent
TargetDual specificity mitogen-activated protein kinase kinase 5(Homo sapiens (Human))
Sabila Biosciences
US Patent
LigandPNGBDBM473175((3S,4S)-3-((4-amino-3-(4-phenoxyphenyl)-1H-pyrazol...)
Affinity DataKd: <5nM. Assay description: Kd: For most assays, kinase-tagged T7 phage strains were prepared in an E. coli host derived from the BL21 strain. E. coli were grown to log-phase an...
Ligand InfoPC cidPC sid
In DepthDetails US Patent
TargetDual specificity mitogen-activated protein kinase kinase 6(Homo sapiens (Human))
Sabila Biosciences
US Patent
LigandPNGBDBM473175((3S,4S)-3-((4-amino-3-(4-phenoxyphenyl)-1H-pyrazol...)
Affinity DataKd:  5.50E+3nM. Assay description: Kd: For most assays, kinase-tagged T7 phage strains were prepared in an E. coli host derived from the BL21 strain. E. coli were grown to log-phase an...
Ligand InfoPC cidPC sid
In DepthDetails US Patent
TargetDual specificity mitogen-activated protein kinase kinase 7(Homo sapiens (Human))
Sabila Biosciences
US Patent
LigandPNGBDBM473175((3S,4S)-3-((4-amino-3-(4-phenoxyphenyl)-1H-pyrazol...)
Affinity DataKd:  5.50E+3nM. Assay description: Kd: For most assays, kinase-tagged T7 phage strains were prepared in an E. coli host derived from the BL21 strain. E. coli were grown to log-phase an...
Ligand InfoPC cidPC sid
In DepthDetails US Patent
TargetProto-oncogene tyrosine-protein kinase Src(Homo sapiens (Human))
Sabila Biosciences
US Patent
LigandPNGBDBM473175((3S,4S)-3-((4-amino-3-(4-phenoxyphenyl)-1H-pyrazol...)
Affinity DataIC50:  750nM. Assay description: IC50: Methods for In Vitro Evaluation Assays known in the art for testing compounds are used to test compounds of this invention and to assess the bi...
Ligand InfoPC cidPC sid
In DepthDetails US Patent
TargetTyrosine-protein kinase Yes(Homo sapiens (Human))
Sabila Biosciences
US Patent
LigandPNGBDBM473175((3S,4S)-3-((4-amino-3-(4-phenoxyphenyl)-1H-pyrazol...)
Affinity DataIC50: <5nM. Assay description: IC50: Methods for In Vitro Evaluation Assays known in the art for testing compounds are used to test compounds of this invention and to assess the bi...
Ligand InfoPC cidPC sid
In DepthDetails US Patent
TargetTyrosine-protein kinase Fgr(Homo sapiens (Human))
Sabila Biosciences
US Patent
LigandPNGBDBM473175((3S,4S)-3-((4-amino-3-(4-phenoxyphenyl)-1H-pyrazol...)
Affinity DataIC50:  52nM. Assay description: IC50 Table 13-20: The protocol calls for test compound of the invention to be incubated with kinase, substrate, cofactors, and radio-isotope-labeled ...
Ligand InfoPC cidPC sid
In DepthDetails US Patent
TargetTyrosine-protein kinase Fyn(Homo sapiens (Human))
Sabila Biosciences
US Patent
LigandPNGBDBM473175((3S,4S)-3-((4-amino-3-(4-phenoxyphenyl)-1H-pyrazol...)
Affinity DataIC50:  52nM. Assay description: IC50 Table 13-20: The protocol calls for test compound of the invention to be incubated with kinase, substrate, cofactors, and radio-isotope-labeled ...
Ligand InfoPC cidPC sid
In DepthDetails US Patent
TargetTyrosine-protein kinase Blk(Homo sapiens (Human))
Sabila Biosciences
US Patent
LigandPNGBDBM473175((3S,4S)-3-((4-amino-3-(4-phenoxyphenyl)-1H-pyrazol...)
Affinity DataIC50:  52nM. Assay description: IC50 Table 13-20: The protocol calls for test compound of the invention to be incubated with kinase, substrate, cofactors, and radio-isotope-labeled ...
Ligand InfoPC cidPC sid
In DepthDetails US Patent
TargetTyrosine-protein kinase Lck(Homo sapiens (Human))
Sabila Biosciences
US Patent
LigandPNGBDBM473175((3S,4S)-3-((4-amino-3-(4-phenoxyphenyl)-1H-pyrazol...)
Affinity DataIC50:  52nM. Assay description: IC50: Methods for In Vitro Evaluation Assays known in the art for testing compounds are used to test compounds of this invention and to assess the bi...
Ligand InfoPC cidPC sid
In DepthDetails US Patent
TargetTyrosine-protein kinase HCK(Homo sapiens (Human))
Sabila Biosciences
US Patent
LigandPNGBDBM473175((3S,4S)-3-((4-amino-3-(4-phenoxyphenyl)-1H-pyrazol...)
Affinity DataIC50:  52nM. Assay description: IC50: Methods for In Vitro Evaluation Assays known in the art for testing compounds are used to test compounds of this invention and to assess the bi...
Ligand InfoPC cidPC sid
In DepthDetails US Patent
TargetTyrosine-protein kinase Lyn(Homo sapiens (Human))
Sabila Biosciences
US Patent
LigandPNGBDBM473175((3S,4S)-3-((4-amino-3-(4-phenoxyphenyl)-1H-pyrazol...)
Affinity DataIC50:  750nM. Assay description: IC50 Table 13-20: The protocol calls for test compound of the invention to be incubated with kinase, substrate, cofactors, and radio-isotope-labeled ...
Ligand InfoPC cidPC sid
In DepthDetails US Patent
TargetTyrosine-protein kinase Fyn [Y531F](Homo sapiens (Human))
Sabila Biosciences
US Patent
LigandPNGBDBM473175((3S,4S)-3-((4-amino-3-(4-phenoxyphenyl)-1H-pyrazol...)
Affinity DataIC50:  52nM. Assay description: IC50 Table 13-20: The protocol calls for test compound of the invention to be incubated with kinase, substrate, cofactors, and radio-isotope-labeled ...
Ligand InfoPC cidPC sid
In DepthDetails US Patent
TargetTyrosine-protein kinase BTK(Homo sapiens (Human))
Sabila Biosciences
US Patent
LigandPNGBDBM473175((3S,4S)-3-((4-amino-3-(4-phenoxyphenyl)-1H-pyrazol...)
Affinity DataIC50:  52nM. Assay description: IC50: Methods for In Vitro Evaluation Assays known in the art for testing compounds are used to test compounds of this invention and to assess the bi...
Ligand InfoPC cidPC sid
In DepthDetails US Patent
TargetReceptor-type tyrosine-protein kinase FLT3(Homo sapiens (Human))
Sabila Biosciences
US Patent
LigandPNGBDBM473175((3S,4S)-3-((4-amino-3-(4-phenoxyphenyl)-1H-pyrazol...)
Affinity DataIC50:  52nM. Assay description: IC50 Table 13-20: The protocol calls for test compound of the invention to be incubated with kinase, substrate, cofactors, and radio-isotope-labeled ...
Ligand InfoPC cidPC sid
In DepthDetails US Patent
TargetDimer of Receptor-type tyrosine-protein kinase FLT3(Homo sapiens (Human))
Sabila Biosciences
US Patent
LigandPNGBDBM473175((3S,4S)-3-((4-amino-3-(4-phenoxyphenyl)-1H-pyrazol...)
Affinity DataIC50:  750nM. Assay description: IC50 Table 13-20: The protocol calls for test compound of the invention to be incubated with kinase, substrate, cofactors, and radio-isotope-labeled ...
Ligand InfoPC cidPC sid
In DepthDetails US Patent
TargetProtein-tyrosine kinase 6(Homo sapiens (Human))
Sabila Biosciences
US Patent
LigandPNGBDBM473175((3S,4S)-3-((4-amino-3-(4-phenoxyphenyl)-1H-pyrazol...)
Affinity DataIC50:  52nM. Assay description: IC50 Table 13-20: The protocol calls for test compound of the invention to be incubated with kinase, substrate, cofactors, and radio-isotope-labeled ...
Ligand InfoPC cidPC sid
In DepthDetails US Patent
TargetMast/stem cell growth factor receptor Kit(Homo sapiens (Human))
Sabila Biosciences
US Patent
LigandPNGBDBM473175((3S,4S)-3-((4-amino-3-(4-phenoxyphenyl)-1H-pyrazol...)
Affinity DataIC50:  5.50E+3nM. Assay description: IC50: Methods for In Vitro Evaluation Assays known in the art for testing compounds are used to test compounds of this invention and to assess the bi...
Ligand InfoPC cidPC sid
In DepthDetails US Patent
TargetProto-oncogene tyrosine-protein kinase receptor Ret(Homo sapiens (Human))
Sabila Biosciences
US Patent
LigandPNGBDBM473175((3S,4S)-3-((4-amino-3-(4-phenoxyphenyl)-1H-pyrazol...)
Affinity DataIC50:  750nM. Assay description: IC50 Table 13-20: The protocol calls for test compound of the invention to be incubated with kinase, substrate, cofactors, and radio-isotope-labeled ...
Ligand InfoPC cidPC sid
In DepthDetails US Patent
TargetSerine/threonine-protein kinase B-raf(Homo sapiens (Human))
Sabila Biosciences
US Patent
LigandPNGBDBM473175((3S,4S)-3-((4-amino-3-(4-phenoxyphenyl)-1H-pyrazol...)
Affinity DataKd:  5.50E+3nM. Assay description: Kd: For most assays, kinase-tagged T7 phage strains were prepared in an E. coli host derived from the BL21 strain. E. coli were grown to log-phase an...
Ligand InfoPC cidPC sid
In DepthDetails US Patent