BDBM47368 BDBM77674::US9034574, XXIV
SMILES COc1ccc(NC(=O)Nc2cccc3cccnc23)cc1
InChI Key InChIKey=FGIJPZDUXLSZJI-UHFFFAOYSA-N
Data  2 IC50
  Tab Delimited (TSV)   2D SDfile   Computed 3D by Vconf -m prep SDfile
Find this compound or compounds like it in BindingDB:
Activity Spreadsheet -- Enzyme Inhibition Constant Data from BindingDB
Found 2 hits for monomerid = 47368
TargetMethyl-CpG-binding protein 2(Homo sapiens (Human))
The Johns Hopkins University
US Patent
LigandPNGBDBM47368(BDBM77674 | US9034574, XXIV)
Affinity DataIC50:  2.81E+3nM. Assay description: DNA binding assays using recombinant MBDs. To produce recombinant His6-tagged MBD polypeptides from human MBD2 (MBD2-MBD), MBD2-MBD cDNA was amplifie...
In DepthDetails US Patent
TargetMethionine--tRNA ligase(Trypanosoma brucei brucei strain 927/4 GUTat10.1)
The Scripps Research Institute Molecular Screening Center
Curated by PubChem BioAssay
LigandPNGBDBM47368(BDBM77674 | US9034574, XXIV)
Affinity DataIC50:  2.82E+3nM
In DepthDetails PCBioAssay