BDBM476315 US10874683, Example EIDD-02357-01::US10874683, Example EIDD-02474-01
SMILES CCCCCCCCCCCCCCCCCCNC(=O)ONc1ccn([C@@H]2O[C@H](CO)[C@H](O)C2O)c(=O)n1
InChI Key InChIKey=MFTQHVGAWIFYAZ-PUGRMHPZSA-N
Data  2 EC50
  Tab Delimited (TSV)   2D SDfile   Computed 3D by Vconf -m prep SDfile
Find this compound or compounds like it in BindingDB:
Activity Spreadsheet -- Enzyme Inhibition Constant Data from BindingDB
Found 2 hits for monomerid = 476315
TargetStructural polyprotein(CHIKV)
Emory University
US Patent
LigandPNGBDBM476315(US10874683, Example EIDD-02357-01 | US10874683, Ex...)
Affinity DataEC50:  70nM. Assay description: Primary cytopathic effect (CPE) reduction assay. Four-concentration CPE inhibition assays are performed. Confluent or near-confluent cell culture mon...
Ligand InfoPC cidPC sid
In DepthDetails US Patent
TargetStructural polyprotein(CHIKV)
Emory University
US Patent
LigandPNGBDBM476315(US10874683, Example EIDD-02357-01 | US10874683, Ex...)
Affinity DataEC50: >7.80E+4nM. Assay description: Primary cytopathic effect (CPE) reduction assay. Four-concentration CPE inhibition assays are performed. Confluent or near-confluent cell culture mon...
Ligand InfoPC cidPC sid
In DepthDetails US Patent