BDBM476594 US10869929, Compound 32::US11554172, Compound 32
SMILES CCCC1O[C@@H]2C[C@H]3[C@@H]4CCC5=Cc6c(C[C@]5(C)[C@H]4[C@@H](O)C[C@]3(C)[C@@]2(O1)C(=O)CO)cnn6-c1ccc(OCCCCCCCCCP(O)(O)=O)cc1
InChI Key InChIKey=WZBNEBURHZRFPI-AXMSIJNASA-N
Data  2 IC50
  Tab Delimited (TSV)   2D SDfile   Computed 3D by Vconf -m prep SDfile
Find this compound or compounds like it in BindingDB:
Activity Spreadsheet -- Enzyme Inhibition Constant Data from BindingDB
Found 2 hits for monomerid = 476594
TargetGlucocorticoid receptor(Homo sapiens (Human))
Merck Sharp & Dohme
US Patent
LigandPNGBDBM476594(US10869929, Compound 32 | US11554172, Compound 32)
Affinity DataIC50:  115nM. Assay description: The potency of binding to gucocorticoid receptor by small molecule compounds was measured with the PolarScreen™ Glucocorticoid Receptor Competitor As...
Ligand InfoPC cidPC sid
In DepthDetails US Patent
TargetTSC22 domain family protein 3(Human)
Merck Sharp & Dohme
US Patent
LigandPNGBDBM476594(US10869929, Compound 32 | US11554172, Compound 32)
Affinity DataIC50:  115nM. Assay description: HUT78 cells were cultured in IMEM plus 20% heat inactivated FBS and cell density was maintained between 0.1 to 1.2 million/mL. 786-O cells were cultu...
Ligand InfoPC cidPC sid
In DepthDetails US Patent