BDBM476949 SARS-CoV-2 3CLpro Inhibitors 3k::SARS-CoV-2 3CLpro Inhibitors 3l
SMILES CC(C)C[C@H](NC(=O)OCC12CC3CC(CC(C3)C1)C2)C(=O)NC(CC1CCNC1=O)C(O)S([O-])(=O)=O
InChI Key InChIKey=AFONNBAHWVWJGI-RSDXKAJASA-M
Data  3 IC50
  Tab Delimited (TSV)   2D SDfile   Computed 3D by Vconf -m prep SDfile
Find this compound or compounds like it in BindingDB:
Activity Spreadsheet -- Enzyme Inhibition Constant Data from BindingDB
Found 3 hits for monomerid = 476949
TargetReplicase polyprotein 1ab(2019-nCoV)
Wichita State University
LigandPNGBDBM476949(SARS-CoV-2 3CLpro Inhibitors 3k | SARS-CoV-2 3CLpr...)
Affinity DataIC50:  150nM. Assay description: Cloning and Expression of the 3CL Protease of SARS-CoV-2 and FRET Enzyme Assays. The codon-optimized cDNA of full length of 3CLpro of SARS-CoV-2 (Gen...
Ligand InfoPC cidPC sid
In DepthDetails ArticlePubMed
TargetReplicase polyprotein 1ab(Middle East respiratory syndrome-related coronavir...)
Wichita State University
LigandPNGBDBM476949(SARS-CoV-2 3CLpro Inhibitors 3k | SARS-CoV-2 3CLpr...)
Affinity DataIC50:  53nM. Assay description: Cloning and Expression of the 3CL Protease of SARS-CoV-2 and FRET Enzyme Assays. The codon-optimized cDNA of full length of 3CLpro of SARS-CoV-2 (Gen...
Ligand InfoPC cidPC sid
In DepthDetails ArticlePubMed
TargetReplicase polyprotein 1ab(2019-nCoV)
Wichita State University
LigandPNGBDBM476949(SARS-CoV-2 3CLpro Inhibitors 3k | SARS-CoV-2 3CLpr...)
Affinity DataIC50:  270nM. Assay description: Cloning and Expression of the 3CL Protease of SARS-CoV-2 and FRET Enzyme Assays. The codon-optimized cDNA of full length of 3CLpro of SARS-CoV-2 (Gen...
Ligand InfoPC cidPC sid
In DepthDetails ArticlePubMed