BDBM476960 peptidomimetic coronavirus 3CLpro inhibitors 2i
SMILES CC(C)C[C@H](NC(=O)[C@@H](NC(=O)OCc1ccccc1)C(C)C)C(=O)N[C@@H](C[C@@H]1CCNC1=O)C(=O)c1nc2ccccc2s1
InChI Key InChIKey=KSCRVOKQPYZBHZ-IXPOFIJOSA-N
Data  1 KI  2 IC50
PDB links: 1 PDB ID matches this monomer.
  Tab Delimited (TSV)   2D SDfile   Computed 3D by Vconf -m prep SDfile
Find this compound or compounds like it in BindingDB:
Activity Spreadsheet -- Enzyme Inhibition Constant Data from BindingDB
Found 3 hits for monomerid = 476960
TargetReplicase polyprotein 1ab(2019-nCoV)
China Pharmaceutical University
Curated by ChEMBL
LigandPNGBDBM476960(peptidomimetic coronavirus 3CLpro inhibitors 2i)
Affinity DataKi:  15nM. Assay description: Inhibition of SARS-CoV2 main protease
Ligand InfoPC cidPC sidPDB
TargetReplicase polyprotein 1ab(Human SARS coronavirus (SARS-CoV) (Severe acute re...)
A*Star
LigandPNGBDBM476960(peptidomimetic coronavirus 3CLpro inhibitors 2i)
Affinity DataIC50:  94nM. Assay description: SARS-CoV-2 3CLpro expression and purification is based on a published procedure and our modified protocol is found in the supplementary file. A highl...
Ligand InfoPC cidPC sidPDB
TargetReplicase polyprotein 1ab(Human SARS coronavirus (SARS-CoV) (Severe acute re...)
A*Star
LigandPNGBDBM476960(peptidomimetic coronavirus 3CLpro inhibitors 2i)
Affinity DataIC50:  1.70E+3nM. Assay description: The assays are from references cited in this article.
Ligand InfoPC cidPC sidPDB