BDBM476974 SARS-CoV-2 3CLP and CoV inhibitor 15n
SMILES COc1cccc2[nH]c(cc12)C(=O)N[C@@H](CC(C)C)C(=O)N[C@@H](C[C@@H]1CCCNC1=O)C(=O)COC(=O)c1c(C)nc(C)nc1C
InChI Key InChIKey=JNFGOKUCIAOPPF-TUSQITKMSA-N
Data  1 IC50
  Tab Delimited (TSV)   2D SDfile   Computed 3D by Vconf -m prep SDfile
Find this compound or compounds like it in BindingDB:
Activity Spreadsheet -- Enzyme Inhibition Constant Data from BindingDB
Found 1 hit for monomerid = 476974
TargetReplicase polyprotein 1ab(2019-nCoV)
University Of Alberta
LigandPNGBDBM476974(SARS-CoV-2 3CLP and CoV inhibitor 15n)
Affinity DataIC50:  22nM. Assay description: Pure SARS-CoV-2 3CLP was obtained as previously described in detail, and the enzymatic activity was confirmed according to an established protocol; s...
Ligand InfoPC cidPC sid
In DepthDetails ArticlePubMed