BDBM479553 US10899735, No. 12
SMILES Clc1c(cccc1-c1cccc(c1Cl)-c1ccc(C2=NCCN2)c(OCCCC#N)n1)-c1ccc(C2=NCCN2)c(OCCCC#N)n1
InChI Key InChIKey=GFAGLLQHURSVID-UHFFFAOYSA-N
Data  1 IC50
  Tab Delimited (TSV)   2D SDfile   Computed 3D by Vconf -m prep SDfile
Find this compound or compounds like it in BindingDB:
Activity Spreadsheet -- Enzyme Inhibition Constant Data from BindingDB
Found 1 hit for monomerid = 479553
TargetProgrammed cell death 1 ligand 1/2(Homo sapiens (Human))
Gilead Sciences
US Patent
LigandPNGBDBM479553(US10899735, No. 12)
Affinity DataIC50:  64nM. Assay description: Compounds were tested in biochemical protein-protein interaction assays to determine if they can specifically block the interaction between the extra...
Ligand InfoPC cidPC sid
In DepthDetails US Patent