BDBM479823 US10899735, No. 282
SMILES COc1nc(ccc1CN1CC2(C1)CCC(=O)N2)-c1cccc(c1Cl)-c1cccc(c1Cl)-c1ccc(OCCN2CC3(C2)CCC(=O)N3)cc1
InChI Key InChIKey=KRYUCPJBROTRRU-UHFFFAOYSA-N
Data  1 IC50
  Tab Delimited (TSV)   2D SDfile   Computed 3D by Vconf -m prep SDfile
Find this compound or compounds like it in BindingDB:
Activity Spreadsheet -- Enzyme Inhibition Constant Data from BindingDB
Found 1 hit for monomerid = 479823
TargetProgrammed cell death 1 ligand 1/2(Homo sapiens (Human))
Gilead Sciences
US Patent
LigandPNGBDBM479823(US10899735, No. 282)
Affinity DataIC50:  109nM. Assay description: Compounds were tested in biochemical protein-protein interaction assays to determine if they can specifically block the interaction between the extra...
Ligand InfoPC cidPC sid
In DepthDetails US Patent