BDBM48224 2-(1-Methyl-5-phenyl-1H-imidazol-2-ylsulfanyl)-1-piperidin-1-yl-ethanone::2-(1-methyl-5-phenyl-imidazol-2-yl)sulfanyl-1-piperidin-1-yl-ethanone::2-(1-methyl-5-phenylimidazol-2-yl)sulfanyl-1-piperidin-1-ylethanone::2-[(1-methyl-5-phenyl-2-imidazolyl)thio]-1-(1-piperidinyl)ethanone::2-[(1-methyl-5-phenyl-imidazol-2-yl)thio]-1-piperidino-ethanone::MLS000527404::SMR000117878::cid_864219
SMILES Cn1c(SCC(=O)N2CCCCC2)ncc1-c1ccccc1
InChI Key InChIKey=CIIRWQCSSFLTFH-UHFFFAOYSA-N
Data  1 EC50
  Tab Delimited (TSV)   2D SDfile   Computed 3D by Vconf -m prep SDfile
Find this compound or compounds like it in BindingDB:
Activity Spreadsheet -- Enzyme Inhibition Constant Data from BindingDB
Found 1 hit for monomerid = 48224
TargetMatrix metalloproteinase-14 [1-36](Homo sapiens (Human))
Sanford-Burnham Center For Chemical Genomics
Curated by PubChem BioAssay
LigandPNGBDBM48224(2-(1-Methyl-5-phenyl-1H-imidazol-2-ylsulfanyl)-1-p...)
Affinity DataEC50:  2.88E+3nM. Assay description: Data Source: Sanford-Burnham Center for Chemical Genomics (SBCCG) Source Affiliation: Sanford-Burnham Medical Research Institute (SBMRI, San Diego, C...
In DepthDetails PCBioAssay