BDBM48303 2-Ethyl-hexanoic acid 2-methoxy-benzylamide::2-ethyl-N-[(2-methoxyphenyl)methyl]hexanamide::2-ethyl-N-o-anisyl-hexanamide::MLS000070379::SMR000010898::cid_647967
SMILES CCCCC(CC)C(=O)NCc1ccccc1OC
InChI Key InChIKey=DGHXBLQDTBOMPC-UHFFFAOYSA-N
Data  1 IC50
  Tab Delimited (TSV)   2D SDfile   Computed 3D by Vconf -m prep SDfile
Find this compound or compounds like it in BindingDB:
Activity Spreadsheet -- Enzyme Inhibition Constant Data from BindingDB
Found 1 hit for monomerid = 48303
TargetEstrogen receptor beta(Homo sapiens (Human))
Emory University
Curated by PubChem BioAssay
LigandPNGBDBM48303(2-Ethyl-hexanoic acid 2-methoxy-benzylamide | 2-et...)
Affinity DataIC50:  5.00E+4nM. Assay description: NIH Molecular Libraries Screening Centers Network [MLSCN] Emory Chemical Biology Discovery Center in MLSCN Assay provider: John A. Katzenellenbogen, ...
In DepthDetails PCBioAssay