BDBM48307 3-(2-thenoylamino)benzoic acid ethyl ester::3-[(Thiophene-2-carbonyl)-amino]-benzoic acid ethyl ester::3-[[oxo(thiophen-2-yl)methyl]amino]benzoic acid ethyl ester::MLS000070338::SMR000009182::cid_649213::ethyl 3-(thiophen-2-ylcarbonylamino)benzoate::ethyl 3-(thiophene-2-carbonylamino)benzoate
SMILES CCOC(=O)c1cccc(NC(=O)c2cccs2)c1
InChI Key InChIKey=ZFIDIYIMLCNQDQ-UHFFFAOYSA-N
Data  1 IC50
  Tab Delimited (TSV)   2D SDfile   Computed 3D by Vconf -m prep SDfile
Find this compound or compounds like it in BindingDB:
Activity Spreadsheet -- Enzyme Inhibition Constant Data from BindingDB
Found 1 hit for monomerid = 48307
TargetEstrogen receptor beta(Homo sapiens (Human))
Emory University
Curated by PubChem BioAssay
LigandPNGBDBM48307(3-(2-thenoylamino)benzoic acid ethyl ester | 3-[(T...)
Affinity DataIC50:  5.00E+4nM. Assay description: NIH Molecular Libraries Screening Centers Network [MLSCN] Emory Chemical Biology Discovery Center in MLSCN Assay provider: John A. Katzenellenbogen, ...
In DepthDetails PCBioAssay