BDBM483673 1-(2-methyl-4-((3- methyl-[1,1'- biphenyl]-4- yl)methyl)- piperazine-1- carbonyl)-1H- pyrazole-3- carboxylic acid::US10927105, Ex 89::US11655217, Example 89
SMILES CC1CN(Cc2ccc(cc2C)-c2ccccc2)CCN1C(=O)n1ccc(n1)C(O)=O
InChI Key InChIKey=LHZLLMKAFUAOKC-UHFFFAOYSA-N
Data  4 IC50
  Tab Delimited (TSV)   2D SDfile   Computed 3D by Vconf -m prep SDfile
Find this compound or compounds like it in BindingDB:
Activity Spreadsheet -- Enzyme Inhibition Constant Data from BindingDB
Found 4 hits for monomerid = 483673
TargetMonoglyceride lipase(Homo sapiens (Human))
Lundbeck La Jolla Research Center
US Patent
LigandPNGBDBM483673(1-(2-methyl-4-((3- methyl-[1,1'- biphenyl]-4- yl)m...)
Affinity DataIC50: <100nM. Assay description: Proteomes (mouse brain membrane fraction for mouse assays; human prefrontal cortex membrane fractions for human assays) (50 mL, 1.0 mg/mL total prote...
Ligand InfoPC cidPC sid
In DepthDetails US Patent
TargetFatty-acid amide hydrolase 1(Homo sapiens (Human))
H. Lundbeck
US Patent
LigandPNGBDBM483673(1-(2-methyl-4-((3- methyl-[1,1'- biphenyl]-4- yl)m...)
Affinity DataIC50:  550nM. Assay description: Proteomes (mouse brain membrane fraction for mouse assays; human prefrontal cortex membrane fractions for human assays) (50 mL, 1.0 mg/mL total prote...
Ligand InfoPC cidPC sid
In DepthDetails US Patent
TargetMonoglyceride lipase(Homo sapiens (Human))
Lundbeck La Jolla Research Center
US Patent
LigandPNGBDBM483673(1-(2-methyl-4-((3- methyl-[1,1'- biphenyl]-4- yl)m...)
Affinity DataIC50: <100nM. Assay description: Proteomes (mouse brain membrane fraction for mouse assays; human prefrontal cortex membrane fractions for human assays) (50 mL, 1.0 mg/mL total prote...
Ligand InfoPC cidPC sid
In DepthDetails US Patent
TargetFatty acid 2-hydroxylase(Human)
Lundbeck La Jolla Research Center
US Patent
LigandPNGBDBM483673(1-(2-methyl-4-((3- methyl-[1,1'- biphenyl]-4- yl)m...)
Affinity DataIC50:  550nM. Assay description: Proteomes (mouse brain membrane fraction for mouse assays; human prefrontal cortex membrane fractions for human assays) (50 mL, 1.0 mg/mL total prote...
Ligand InfoPC cidPC sid
In DepthDetails US Patent