BDBM484212 Inhibitor 20 of SARS-CoV-2 Mpro
SMILES Cn1cc(-c2cc(-c3cc(Cl)c(F)c(OCc4ocnc4C(F)(F)F)c3)c(=O)n(c2)-c2cccnc2)c(=O)[nH]c1=O
InChI Key InChIKey=ZEYWGWJNHQOCTE-UHFFFAOYSA-N
Data  1 IC50
  Tab Delimited (TSV)   2D SDfile   Computed 3D by Vconf -m prep SDfile
Find this compound or compounds like it in BindingDB:
Activity Spreadsheet -- Enzyme Inhibition Constant Data from BindingDB
Found 1 hit for monomerid = 484212
TargetReplicase polyprotein 1ab(2019-nCoV)
Yale University
LigandPNGBDBM484212(Inhibitor 20 of SARS-CoV-2 Mpro)
Affinity DataIC50:  130nM. Assay description: Purified protein is diluted in reaction buffer to 100 nM in an opaque 96-well plate. The protein is incubated with or without compound in DMSO at dif...
Ligand InfoPC cidPC sid
In DepthDetails ArticlePubMed