BDBM485659 US10940139, Example 02680::US11000515, Compound TABLE 7.231::US11213515, TABLE 7.231::US11541041, Compound Table 7.210
SMILES Oc1nc(nc2c(csc12)C(=O)N1CCN(CC1)c1ccccc1)-c1ccccn1
InChI Key InChIKey=NBUHZJNQKHPLPW-UHFFFAOYSA-N
Data  4 IC50
  Tab Delimited (TSV)   2D SDfile   Computed 3D by Vconf -m prep SDfile
Find this compound or compounds like it in BindingDB:
Activity Spreadsheet -- Enzyme Inhibition Constant Data from BindingDB
Found 4 hits for monomerid = 485659
TargetGTPase KRas [G12D](Homo sapiens (Human))
Shy Therapeutics
US Patent
LigandPNGBDBM485659(US10940139, Example 02680 | US11000515, Compound T...)
Affinity DataIC50:  7.50E+3nM. Assay description: Buffer-I: 50 mM Tris, pH 7.5 150 mM NaCl (optional) 1 mM MgCl2 1 mM DTT. KRas G12D mutant protein was expressed as...
Ligand InfoPC cidPC sid
In DepthDetails US Patent
TargetGTPase KRas [G12D,Q61H](Homo sapiens (Human))
Shy Therapeutics
US Patent
LigandPNGBDBM485659(US10940139, Example 02680 | US11000515, Compound T...)
Affinity DataIC50:  7.50E+3nM. Assay description: The following method was developed as specific assay for KRas G12D mutant protein.Buffer-I:50 mM Tris, pH 7.5150 mM NaCl (optional)1 mM MgCl21 mM DTT...
Ligand InfoPC cidPC sid
In DepthDetails US Patent
TargetGTPase KRas [G12D,Q61H](Homo sapiens (Human))
Shy Therapeutics
US Patent
LigandPNGBDBM485659(US10940139, Example 02680 | US11000515, Compound T...)
Affinity DataIC50:  7.50E+3nM. Assay description: The following method was developed as specific assay for KRas G12D mutant protein.Buffer-I: 50 mM Tris, pH 7.5 150 mM NaCl (optional) ...
Ligand InfoPC cidPC sid
In DepthDetails US Patent
TargetGTPase KRas [G12D,Q61H](Homo sapiens (Human))
Shy Therapeutics
US Patent
LigandPNGBDBM485659(US10940139, Example 02680 | US11000515, Compound T...)
Affinity DataIC50:  7.50E+3nM. Assay description: Buffer-I: 50 mM Tris, pH 7.5 150 mM NaCl (optional) 1 mM MgCl2 1 mM DTT. KRas G12D mutant protein was expressed as...
Ligand InfoPC cidPC sid
In DepthDetails US Patent