BDBM485673 US10940139, Example 02899::US11000515, Compound TABLE 7.450::US11213515, TABLE 7.450::US11541041, Compound Table 7.429
SMILES CN1CCN(CC1)c1nc(nc2scc(C(=O)NCCc3cnc(O)nc3)c12)-c1ccccn1
InChI Key InChIKey=UBNSTQNNBOYKTA-UHFFFAOYSA-N
Data  4 IC50
  Tab Delimited (TSV)   2D SDfile   Computed 3D by Vconf -m prep SDfile
Find this compound or compounds like it in BindingDB:
Activity Spreadsheet -- Enzyme Inhibition Constant Data from BindingDB
Found 4 hits for monomerid = 485673
TargetGTPase KRas [G12D](Homo sapiens (Human))
Shy Therapeutics
US Patent
LigandPNGBDBM485673(US10940139, Example 02899 | US11000515, Compound T...)
Affinity DataIC50: >3.00E+4nM. Assay description: Buffer-I: 50 mM Tris, pH 7.5 150 mM NaCl (optional) 1 mM MgCl2 1 mM DTT. KRas G12D mutant protein was expressed as...
Ligand InfoPC cidPC sid
In DepthDetails US Patent
TargetGTPase KRas [G12D,Q61H](Homo sapiens (Human))
Shy Therapeutics
US Patent
LigandPNGBDBM485673(US10940139, Example 02899 | US11000515, Compound T...)
Affinity DataIC50: >3.00E+4nM. Assay description: The following method was developed as specific assay for KRas G12D mutant protein.Buffer-I:50 mM Tris, pH 7.5150 mM NaCl (optional)1 mM MgCl21 mM DTT...
Ligand InfoPC cidPC sid
In DepthDetails US Patent
TargetGTPase KRas [G12D,Q61H](Homo sapiens (Human))
Shy Therapeutics
US Patent
LigandPNGBDBM485673(US10940139, Example 02899 | US11000515, Compound T...)
Affinity DataIC50: >3.00E+3nM. Assay description: The following method was developed as specific assay for KRas G12D mutant protein.Buffer-I: 50 mM Tris, pH 7.5 150 mM NaCl (optional) ...
Ligand InfoPC cidPC sid
In DepthDetails US Patent
TargetGTPase KRas [G12D,Q61H](Homo sapiens (Human))
Shy Therapeutics
US Patent
LigandPNGBDBM485673(US10940139, Example 02899 | US11000515, Compound T...)
Affinity DataIC50: >3.00E+4nM. Assay description: Buffer-I: 50 mM Tris, pH 7.5 150 mM NaCl (optional) 1 mM MgCl2 1 mM DTT. KRas G12D mutant protein was expressed as...
Ligand InfoPC cidPC sid
In DepthDetails US Patent