BDBM486377 3-(3-(difluoromethoxy)phenyl)-N-(1,1- dioxidotetrahydrothiophen-3-yl)-1-(5- fluoropyridin-2-yl)-1H-indole-6- carboxamide (enantiomer A)::US10947222, Example 13-A
SMILES FC(F)Oc1cccc(c1)-c1cn(-c2ccc(F)cn2)c2cc(ccc12)C(=O)N[C@H]1CCS(=O)(=O)C1
InChI Key InChIKey=BKSSKLIDWLGWTA-SFHVURJKSA-N
Data  1 IC50
  Tab Delimited (TSV)   2D SDfile   Computed 3D by Vconf -m prep SDfile
Find this compound or compounds like it in BindingDB:
Activity Spreadsheet -- Enzyme Inhibition Constant Data from BindingDB
Found 1 hit for monomerid = 486377
TargetDiacylglycerol O-acyltransferase 2(Homo sapiens (Human))
Merck Sharp & Dohme
US Patent
LigandPNGBDBM486377(3-(3-(difluoromethoxy)phenyl)-N-(1,1- dioxidotetra...)
Affinity DataIC50:  1.80nM. Assay description: DGAT2 activity was determined by measuring the amount of enzymatic product triolein (1,2,3-Tri(cis-9-octadecenoyl)glycerol) using the membrane prep m...
Ligand InfoPC cidPC sid
In DepthDetails US Patent