BDBM495441 MAT-POS-4223bc15-14
SMILES Clc1ccc2CN(CC(C(=O)Nc3cncc4ccccc34)c2c1)S(=O)(=O)CC1CNC1
InChI Key InChIKey=OVJUBIHYMLYNOD-UHFFFAOYSA-N
Data  3 IC50
  Tab Delimited (TSV)   2D SDfile   Computed 3D by Vconf -m prep SDfile
Find this compound or compounds like it in BindingDB:
Activity Spreadsheet -- Enzyme Inhibition Constant Data from BindingDB
Found 3 hits for monomerid = 495441
TargetReplicase polyprotein 1ab(2019-nCoV)
Israel Institution Of Biological Research
LigandPNGBDBM495441(MAT-POS-4223bc15-14)
Affinity DataIC50:  135nM. Assay description: Compounds were seeded into assay-ready plates (Greiner 384 low volume, cat 784900) using an Echo 555 acoustic dispenser, and DMSO was back-filled for...
Ligand InfoPC cidPC sid
In DepthDetails
TargetReplicase polyprotein 1ab(2019-nCoV)
Israel Institution Of Biological Research
LigandPNGBDBM495441(MAT-POS-4223bc15-14)
Affinity DataIC50:  135nM. Assay description: This assay is for S2.
Ligand InfoPC cidPC sid
In DepthDetails PubMed
TargetReplicase polyprotein 1ab(2019-nCoV)
Israel Institution Of Biological Research
LigandPNGBDBM495441(MAT-POS-4223bc15-14)
Affinity DataIC50:  135nM. Assay description: Compounds were seeded into assay-ready plates (Greiner 384 low volume, cat. no. 784900) using an Echo 555 acoustic dispenser, and dimethyl sulfoxide ...
Ligand InfoPC cidPC sid
In DepthDetails PubMed