BDBM495448 MAT-POS-4223bc15-23
SMILES CNC(=O)CN1CC(C(=O)Nc2cncc3ccccc23)c2cc(Cl)ccc2C1
InChI Key InChIKey=BNHZFFZRNBJNJB-UHFFFAOYSA-N
Data  3 IC50
PDB links: 1 PDB ID matches this monomer.
  Tab Delimited (TSV)   2D SDfile   Computed 3D by Vconf -m prep SDfile
Find this compound or compounds like it in BindingDB:
Activity Spreadsheet -- Enzyme Inhibition Constant Data from BindingDB
Found 3 hits for monomerid = 495448
TargetReplicase polyprotein 1ab(2019-nCoV)
Israel Institution Of Biological Research
LigandPNGBDBM495448(MAT-POS-4223bc15-23)
Affinity DataIC50:  69nM. Assay description: Compounds were seeded into assay-ready plates (Greiner 384 low volume, cat 784900) using an Echo 555 acoustic dispenser, and DMSO was back-filled for...
Ligand InfoPC cidPC sidPDB
In DepthDetails PDB3D3D Structure (crystal)
TargetReplicase polyprotein 1ab(2019-nCoV)
Israel Institution Of Biological Research
LigandPNGBDBM495448(MAT-POS-4223bc15-23)
Affinity DataIC50:  79nM. Assay description: This assay is for S2.
Ligand InfoPC cidPC sidPDB
TargetReplicase polyprotein 1ab(2019-nCoV)
Israel Institution Of Biological Research
LigandPNGBDBM495448(MAT-POS-4223bc15-23)
Affinity DataIC50:  79nM. Assay description: Compounds were seeded into assay-ready plates (Greiner 384 low volume, cat. no. 784900) using an Echo 555 acoustic dispenser, and dimethyl sulfoxide ...
Ligand InfoPC cidPC sidPDB