BDBM495598 CVD-0016334::STE-KUL-d79e3d6a-2
SMILES COC(=O)\C=C\C(=O)N(CCC(N)=O)NC(=O)[C@@H](CC(C)C)NC(=O)[C@@H](NC(=O)CCCC#C)C(C)(C)C
InChI Key InChIKey=DKOIBTIRJIPLGM-IBZIQKAZSA-N
Data  2 IC50
  Tab Delimited (TSV)   2D SDfile   Computed 3D by Vconf -m prep SDfile
Find this compound or compounds like it in BindingDB:
Activity Spreadsheet -- Enzyme Inhibition Constant Data from BindingDB
Found 2 hits for monomerid = 495598
TargetReplicase polyprotein 1ab(2019-nCoV)
Cornell University
LigandPNGBDBM495598(CVD-0016334 | STE-KUL-d79e3d6a-2)
Affinity DataIC50:  44nM. Assay description: Compounds were seeded into assay-ready plates (Greiner 384 low volume, cat. no. 784900) using an Echo 555 acoustic dispenser, and dimethyl sulfoxide ...
Ligand InfoPC cidPC sid
In DepthDetails PubMed
TargetReplicase polyprotein 1ab(2019-nCoV)
Cornell University
LigandPNGBDBM495598(CVD-0016334 | STE-KUL-d79e3d6a-2)
Affinity DataIC50:  44nM. Assay description: Compounds were seeded into assay-ready plates (Greiner 384 low volume, cat 784900) using an Echo 555 acoustic dispenser, and DMSO was back-filled for...
Ligand InfoPC cidPC sid
In DepthDetails