BDBM495999 CVD-0014468::MAT-POS-23a8a11a-1
SMILES Clc1ccc(CC(=O)Nc2cncc3ccccc23)cc1Cl
InChI Key InChIKey=OQQVTWZLQHBDCJ-UHFFFAOYSA-N
Data  3 IC50
  Tab Delimited (TSV)   2D SDfile   Computed 3D by Vconf -m prep SDfile
Find this compound or compounds like it in BindingDB:
Activity Spreadsheet -- Enzyme Inhibition Constant Data from BindingDB
Found 3 hits for monomerid = 495999
TargetReplicase polyprotein 1ab(2019-nCoV)
Israel Institution Of Biological Research
LigandPNGBDBM495999(CVD-0014468 | MAT-POS-23a8a11a-1)
Affinity DataIC50:  132nM. Assay description: The assay was performed according to the published procedure. Briefly, compounds were seeded into assay-ready plates (Greiner 384PP, cat# 781280) usi...
Ligand InfoPC cidPC sid
In DepthDetails
TargetReplicase polyprotein 1ab(2019-nCoV)
Israel Institution Of Biological Research
LigandPNGBDBM495999(CVD-0014468 | MAT-POS-23a8a11a-1)
Affinity DataIC50:  281nM. Assay description: Compounds were seeded into assay-ready plates (Greiner 384 low volume, cat. no. 784900) using an Echo 555 acoustic dispenser, and dimethyl sulfoxide ...
Ligand InfoPC cidPC sid
In DepthDetails PubMed
TargetReplicase polyprotein 1ab(2019-nCoV)
Israel Institution Of Biological Research
LigandPNGBDBM495999(CVD-0014468 | MAT-POS-23a8a11a-1)
Affinity DataIC50:  261nM. Assay description: Compounds were seeded into assay-ready plates (Greiner 384 low volume, cat 784900) using an Echo 555 acoustic dispenser, and DMSO was back-filled for...
Ligand InfoPC cidPC sid
In DepthDetails