BDBM496843 SARS-CoV-2 PLpro Inhibitor, 73
SMILES C[C@@H](NC(=O)c1cc(NC2CNC2)ccc1C)c1cccc(c1)-c1ccc(CN2CCCC2)s1
InChI Key InChIKey=ZTKSBNLNPMUGBL-HXUWFJFHSA-N
Data  1 IC50  1 Kd  1 EC50
PDB links: 1 PDB ID matches this monomer.
  Tab Delimited (TSV)   2D SDfile   Computed 3D by Vconf -m prep SDfile
Find this compound or compounds like it in BindingDB:
Activity Spreadsheet -- Enzyme Inhibition Constant Data from BindingDB
Found 3 hits for monomerid = 496843
TargetReplicase polyprotein 1ab(2019-nCoV)
University Of Illinois At Chicago
LigandPNGBDBM496843(SARS-CoV-2 PLpro Inhibitor, 73)
Affinity DataIC50:  560nM. Assay description: The PLpro primary assay, which measures protease activity with the short peptide substrate Z-RLRGG-AMC (Bachem), was performed in black flat-bottom 3...
Ligand InfoPC cidPC sidPDB
TargetAngiotensin-converting enzyme 2(Homo sapiens (Human))
University Of Illinois At Chicago
LigandPNGBDBM496843(SARS-CoV-2 PLpro Inhibitor, 73)
Affinity DataEC50:  1.20E+3nM. Assay description: A549-hACE2 cells were seeded 1.5 × 105 cells/well in DMEM complete into 24-well plates (0.5 mL/well) and then incubated for 16 h at 37 °C and 5% CO2....
Ligand InfoPC cidPC sidPDB
In DepthDetails ArticlePubMed
TargetReplicase polyprotein 1ab(2019-nCoV)
University Of Illinois At Chicago
LigandPNGBDBM496843(SARS-CoV-2 PLpro Inhibitor, 73)
Affinity DataKd:  372nM. Assay description: The His-tagged SARS-CoV-2 PLpro enzyme was initially prepared in phosphate buffer and diluted to 50 ug/mL with 10 mM sodium acetate (pH 5.5) and immo...
Ligand InfoPC cidPC sidPDB