BDBM496872 FL-078::cmdc.202100576, 4b
SMILES OB(O)c1cc(cc(c1)[N+]([O-])=O)C(=O)Oc1ccc(OC(=O)c2cc(cc(c2)[N+]([O-])=O)B(O)O)cc1
InChI Key InChIKey=VHPAREHFOBKUCA-UHFFFAOYSA-N
Data  1 KI
  Tab Delimited (TSV)   2D SDfile   Computed 3D by Vconf -m prep SDfile
Find this compound or compounds like it in BindingDB:
Activity Spreadsheet -- Enzyme Inhibition Constant Data from BindingDB
Found 1 hit for monomerid = 496872
TargetReplicase polyprotein 1ab(Human SARS coronavirus (SARS-CoV) (Severe acute re...)
Experimental Drug Development Centre
LigandPNGBDBM496872(FL-078 | cmdc.202100576, 4b)
Affinity DataKi:  6.70E+3nM. Assay description: Please point to the patents.
Ligand InfoPC cidPC sid
In DepthDetails ArticlePubMed