BDBM496899 TG-0204998::cmdc.202100576, 5f
SMILES COC(=O)\C=C\[C@H](C[C@@H]1CCNC1=O)NC(=O)[C@H](CC(C)C)NC(=O)[C@@H](NC(=O)OCc1ccccc1)C(C)NC(=O)C(C)(C)C
InChI Key InChIKey=KVKPDEXNAXXWLQ-SKPRUEEXSA-N
Data  1 KI
  Tab Delimited (TSV)   2D SDfile   Computed 3D by Vconf -m prep SDfile
Find this compound or compounds like it in BindingDB:
Activity Spreadsheet -- Enzyme Inhibition Constant Data from BindingDB
Found 1 hit for monomerid = 496899
TargetReplicase polyprotein 1ab(Human SARS coronavirus (SARS-CoV) (Severe acute re...)
Experimental Drug Development Centre
LigandPNGBDBM496899(TG-0204998 | cmdc.202100576, 5f)
Affinity DataKi:  38nM. Assay description: Please point to the patents.
Ligand InfoPC cidPC sid
In DepthDetails ArticlePubMed