BDBM496985 US11001555, Example 8
SMILES COc1ccc(CS(=O)(=O)[C@@H]2C[C@H](N(C2)C(=O)[C@H](Cc2cccc(c2)C#N)NC(=O)c2ccccn2)C(=O)N[C@@H](C(C)C)C(=O)C(F)(F)C(=O)NCC(F)(F)F)cc1
InChI Key InChIKey=GCXKEZQVMCVYAP-SPQIZYAFSA-N
Data  1 IC50
  Tab Delimited (TSV)   2D SDfile   Computed 3D by Vconf -m prep SDfile
Find this compound or compounds like it in BindingDB:
Activity Spreadsheet -- Enzyme Inhibition Constant Data from BindingDB
Found 1 hit for monomerid = 496985
TargetSerine protease HTRA1(Homo sapiens (Human))
Hoffmann-La Roche
US Patent
LigandPNGBDBM496985(US11001555, Example 8)
Affinity DataIC50:  1.33nM. Assay description: Enzyme activity is measured by observing the increase in fluorescence intensity caused by cleavage of a peptide substrate containing a fluorophore, w...
Ligand InfoPC cidPC sid
In DepthDetails US Patent