BDBM497008 US11001561, Compound 5::US11702392, Compound 5
SMILES C[C@@H]1OCC2(CCN(CC2)c2cc(=O)n(c(N)n2)-c2cccc(Cl)c2Cl)[C@@H]1N
InChI Key InChIKey=QFVUPPYOYIKZSH-APPDUMDISA-N
Data  2 IC50
  Tab Delimited (TSV)   2D SDfile   Computed 3D by Vconf -m prep SDfile
Find this compound or compounds like it in BindingDB:
Activity Spreadsheet -- Enzyme Inhibition Constant Data from BindingDB
Found 2 hits for monomerid = 497008
TargetTyrosine-protein phosphatase non-receptor type 11(Homo sapiens)
Merck Patent
US Patent
LigandPNGBDBM497008(US11001561, Compound 5 | US11702392, Compound 5)
Affinity DataIC50:  760nM. Assay description: The inhibition of SHP2 by compounds of the invention was monitored using the surrogate substrate DiFMUP after protein activation by a peptide bearing...
Ligand InfoPC cidPC sid
In DepthDetails US Patent
TargetTyrosine-protein phosphatase non-receptor type 11(Homo sapiens (Human))
Merck Patent
US Patent
LigandPNGBDBM497008(US11001561, Compound 5 | US11702392, Compound 5)
Affinity DataIC50:  760nM. Assay description: The inhibition of SHP2 by compounds of the invention was monitored using the surrogate substrate DiFMUP after protein activation by a peptide bearing...
Ligand InfoPC cidPC sid
In DepthDetails US Patent