BDBM497035 US11001561, Compound 30::US11702392, Compound 30
SMILES Cc1nc(cc(=O)n1-c1cccc(Cl)c1Cl)N1CC[C@@H](N)[C@@H](O)C1
InChI Key InChIKey=QSEBRWWONUZUNY-YPMHNXCESA-N
Data  2 IC50
  Tab Delimited (TSV)   2D SDfile   Computed 3D by Vconf -m prep SDfile
Find this compound or compounds like it in BindingDB:
Activity Spreadsheet -- Enzyme Inhibition Constant Data from BindingDB
Found 2 hits for monomerid = 497035
TargetTyrosine-protein phosphatase non-receptor type 11(Homo sapiens)
Merck Patent
US Patent
LigandPNGBDBM497035(US11001561, Compound 30 | US11702392, Compound 30)
Affinity DataIC50:  1.30E+4nM. Assay description: The inhibition of SHP2 by compounds of the invention was monitored using the surrogate substrate DiFMUP after protein activation by a peptide bearing...
Ligand InfoPC cidPC sid
In DepthDetails US Patent
TargetTyrosine-protein phosphatase non-receptor type 11(Homo sapiens (Human))
Merck Patent
US Patent
LigandPNGBDBM497035(US11001561, Compound 30 | US11702392, Compound 30)
Affinity DataIC50:  1.30E+4nM. Assay description: The inhibition of SHP2 by compounds of the invention was monitored using the surrogate substrate DiFMUP after protein activation by a peptide bearing...
Ligand InfoPC cidPC sid
In DepthDetails US Patent