BDBM497209 US11001563, Compound WX104
SMILES Cn1nc(CC(F)(F)F)nc1-c1ccc(OC\C(CN)=C/F)cc1
InChI Key InChIKey=RAJBEUNKDYUIPR-YFHOEESVSA-N
Data  1 IC50
  Tab Delimited (TSV)   2D SDfile   Computed 3D by Vconf -m prep SDfile
Find this compound or compounds like it in BindingDB:
Activity Spreadsheet -- Enzyme Inhibition Constant Data from BindingDB
Found 1 hit for monomerid = 497209
TargetMembrane primary amine oxidase(Homo sapiens (Human))
TBA
US Patent
LigandPNGBDBM497209(US11001563, Compound WX104)
Affinity DataIC50:  0.300nM. Assay description: The inhibition of the sample on VAP-enzyme activity was measured by using an Amplex® Red Monoamine Oxidase kit (Invitrogen #A12214). 100 nL of the gr...
Ligand InfoPC cidPC sid
In DepthDetails US Patent