BDBM497250 (4-(7-((1R,4S)-4- hydroxycyclohexyl)-2- (((S)-pentan-2-yl)amino)- 7H-pyrrolo[2,3- d]pyrimidin-5-yl)piperidin- 1-yl)(1-methylpyrrolidin-2- yl)methanone::US11001586, Example 21
SMILES CCC[C@H](C)Nc1ncc2c(cn([C@H]3CC[C@H](O)CC3)c2n1)C1CCN(CC1)C(=O)C1CCCCN1C
InChI Key InChIKey=WUHGCCVXBHUUSZ-PTFKTHEZSA-N
Data  2 IC50
  Tab Delimited (TSV)   2D SDfile   Computed 3D by Vconf -m prep SDfile
Find this compound or compounds like it in BindingDB:
Activity Spreadsheet -- Enzyme Inhibition Constant Data from BindingDB
Found 2 hits for monomerid = 497250
TargetTyrosine-protein kinase receptor TYRO3(Homo sapiens (Human))
The University Of North Carolina At Chapel Hill
US Patent
LigandPNGBDBM497250((4-(7-((1R,4S)-4- hydroxycyclohexyl)-2- (((S)-pent...)
Affinity DataIC50:  750nM. Assay description: Activity Against Tyro3 Tyrosine Kinase.
Ligand InfoPC cidPC sid
In DepthDetails US Patent
TargetTyrosine-protein kinase Mer(Homo sapiens (Human))
The University Of North Carolina At Chapel Hill
US Patent
LigandPNGBDBM497250((4-(7-((1R,4S)-4- hydroxycyclohexyl)-2- (((S)-pent...)
Affinity DataIC50: <3nM. Assay description: Activity Against Mer Tyrosine Kinase.
Ligand InfoPC cidPC sid
In DepthDetails US Patent