BDBM497307 N-[(6-chloro-2-fluoro-3-methoxyphenyl)methyl]-3-(methoxymethyl)-1-({4-[(2-::US11001578, Example 99::US11084809, Example 99::US11198691, Example 99
SMILES COCc1nn(Cc2ccc(Cn3ccccc3=O)cc2)cc1C(=O)NCc1c(Cl)ccc(OC)c1F
InChI Key InChIKey=AJVITEJNDAKYPL-UHFFFAOYSA-N
Data  7 IC50
  Tab Delimited (TSV)   2D SDfile   Computed 3D by Vconf -m prep SDfile
Find this compound or compounds like it in BindingDB:
Activity Spreadsheet -- Enzyme Inhibition Constant Data from BindingDB
Found 7 hits for monomerid = 497307
TargetPlasma kallikrein(Homo sapiens (Human))
Kalvista Pharmaceuticals
US Patent
LigandPNGBDBM497307(N-[(6-chloro-2-fluoro-3-methoxyphenyl)methyl]-3-(m...)
Affinity DataIC50:  6.40nM. Assay description: Plasma kallikrein inhibitory activity in vitro was determined using standard published methods (see e.g. Johansen et al., Int. J. Tiss. Reac. 1986, 8...
Ligand InfoPC cidPC sid
In DepthDetails US Patent
TargetKallikrein-1(Homo sapiens (Human))
Kalvista Pharmaceuticals
US Patent
LigandPNGBDBM497307(N-[(6-chloro-2-fluoro-3-methoxyphenyl)methyl]-3-(m...)
Affinity DataIC50: >1.00E+4nM. Assay description: KLK1 inhibitory activity in vitro was determined using standard published methods (see e.g. Johansen et al., Int. J. Tiss. Reac. 1986, 8, 185; Shori ...
Ligand InfoPC cidPC sid
In DepthDetails US Patent
TargetPlasma kallikrein(Homo sapiens (Human))
Kalvista Pharmaceuticals
US Patent
LigandPNGBDBM497307(N-[(6-chloro-2-fluoro-3-methoxyphenyl)methyl]-3-(m...)
Affinity DataIC50:  6.40nM. Assay description: Plasma kallikrein inhibitory activity in vitro was determined using standard published methods (see e.g. Johansen et al., Int. J. Tiss. Reac. 1986, 8...
Ligand InfoPC cidPC sid
In DepthDetails US Patent
TargetPlasma kallikrein(Homo sapiens (Human))
Kalvista Pharmaceuticals
US Patent
LigandPNGBDBM497307(N-[(6-chloro-2-fluoro-3-methoxyphenyl)methyl]-3-(m...)
Affinity DataIC50:  5.5nM. Assay description: Inhibition of human plasma kallikrein using H-D-Pro-Phe-Arg-AFC as flurogenic substrate preincubated for 5 mins followed by substrate addition by flu...
Ligand InfoPC cidPC sid
In DepthDetails PubMed
TargetPlasma kallikrein(Homo sapiens (Human))
Kalvista Pharmaceuticals
US Patent
LigandPNGBDBM497307(N-[(6-chloro-2-fluoro-3-methoxyphenyl)methyl]-3-(m...)
Affinity DataIC50:  6.40nM. Assay description: KLK1 inhibitory activity in vitro was determined using standard published methods. Human KLK1 (Callbiochem) was incubated at 25° C. with the fluoroge...
Ligand InfoPC cidPC sid
In DepthDetails US Patent
TargetKallikrein-1(Homo sapiens (Human))
Kalvista Pharmaceuticals
US Patent
LigandPNGBDBM497307(N-[(6-chloro-2-fluoro-3-methoxyphenyl)methyl]-3-(m...)
Affinity DataIC50: >1.00E+4nM. Assay description: Plasma kallikrein inhibitory activity in vitro was determined using standard published methods. Human plasma kallikrein (Protogen) was incubated at 2...
Ligand InfoPC cidPC sid
In DepthDetails US Patent
TargetKallikrein-1(Homo sapiens (Human))
Kalvista Pharmaceuticals
US Patent
LigandPNGBDBM497307(N-[(6-chloro-2-fluoro-3-methoxyphenyl)methyl]-3-(m...)
Affinity DataIC50: >1.00E+4nM. Assay description: KLK1 inhibitory activity in vitro was determined using standard published methods (see e.g. Johansen et al., Int. J. Tiss. Reac. 1986, 8, 185; Shori ...
Ligand InfoPC cidPC sid
In DepthDetails US Patent