BDBM497474 US11008304, Example 60
SMILES CC(C)n1ccc(n1)-c1cc(C(=O)Nc2cccc(n2)-c2nnnn2[C@H](C)CO)c(F)cc1C
InChI Key InChIKey=LSTDQCHEBLPZCE-OAHLLOKOSA-N
Data  1 IC50
  Tab Delimited (TSV)   2D SDfile   Computed 3D by Vconf -m prep SDfile
Find this compound or compounds like it in BindingDB:
Activity Spreadsheet -- Enzyme Inhibition Constant Data from BindingDB
Found 1 hit for monomerid = 497474
TargetMitogen-activated protein kinase kinase kinase 5(Homo sapiens (Human))
Enanta Pharmaceuticals
US Patent
LigandPNGBDBM497474(US11008304, Example 60)
Affinity DataIC50:  55nM. Assay description: The ability (IC50) of compounds to inhibit ASK1 kinase activity was determined by HTRF® KinEASE™ Assay System. ASK1 was purchased from Thermofisher (...
Ligand InfoPC cidPC sid
In DepthDetails US Patent