BDBM497581 3-[3-[6-[(1S,8R)-5-(2,6-difluorophenyl)- 11,11-dimethyl-3,4- diazatricyclo[6.2.1.02,7]undeca-2(7),3,5- trien-1-yl]-2-pyridyl]pyrazol-1- yl]propanenitrile::US11008312, Example 76
SMILES CC1(C)[C@H]2CC[C@@]1(c1nnc(cc21)-c1c(F)cccc1F)c1cccc(n1)-c1ccn(CCC#N)n1
InChI Key InChIKey=UQDHFYWOUJRPHI-JMQGSBJISA-N
Data  1 IC50
  Tab Delimited (TSV)   2D SDfile   Computed 3D by Vconf -m prep SDfile
Find this compound or compounds like it in BindingDB:
Activity Spreadsheet -- Enzyme Inhibition Constant Data from BindingDB
Found 1 hit for monomerid = 497581
TargetNuclear receptor ROR-gamma(Homo sapiens (Human))
Genentech
US Patent
LigandPNGBDBM497581(3-[3-[6-[(1S,8R)-5-(2,6-difluorophenyl)- 11,11-dim...)
Affinity DataIC50:  5.40nM. Assay description: 50 mM HEPES buffer (pH 7.4); 150 mM NaCl; 1 mM DTT; 5 mM MgCl2; 0.01% BSA; 5% DMSO; 0.6 ug/mL RORc receptor; 6 nM 25-[3H]hydroxycholesterol. For NSB ...
Ligand InfoPC cidPC sid
In DepthDetails US Patent