BDBM497659 N-(2-hydroxyethyl)-2-[4-[6-[(1S,8R)-5- (2,6-difluorophenyl)-11,11-dimethyl-3,4- diazatricyclo[6.2.1.02,7]undeca-2(7),3,5- trien-1-yl]-2-pyridyl]pyrazol-1- yl]acetamide::US11008312, Example 153
SMILES CC1(C)[C@H]2CC[C@@]1(c1nnc(cc21)-c1c(F)cccc1F)c1cccc(n1)-c1cnn(CC(=O)NCCO)c1
InChI Key InChIKey=BDYQIIXPRSOKMO-SLQAJWMNSA-N
Data  1 IC50
  Tab Delimited (TSV)   2D SDfile   Computed 3D by Vconf -m prep SDfile
Find this compound or compounds like it in BindingDB:
Activity Spreadsheet -- Enzyme Inhibition Constant Data from BindingDB
Found 1 hit for monomerid = 497659
TargetNuclear receptor ROR-gamma(Homo sapiens (Human))
Genentech
US Patent
LigandPNGBDBM497659(N-(2-hydroxyethyl)-2-[4-[6-[(1S,8R)-5- (2,6-difluo...)
Affinity DataIC50:  5.20nM. Assay description: 50 mM HEPES buffer (pH 7.4); 150 mM NaCl; 1 mM DTT; 5 mM MgCl2; 0.01% BSA; 5% DMSO; 0.6 ug/mL RORc receptor; 6 nM 25-[3H]hydroxycholesterol. For NSB ...
Ligand InfoKEGGPC cidPC sid
In DepthDetails US Patent