BDBM498083 US11013745, Compound E-Y1
SMILES Fc1ccc2OCCc2c1CNc1ncc(C2=CCOCC2)c2nncn12
InChI Key InChIKey=PPONVVPFTUWVON-UHFFFAOYSA-N
Data  1 IC50
  Tab Delimited (TSV)   2D SDfile   Computed 3D by Vconf -m prep SDfile
Find this compound or compounds like it in BindingDB:
Activity Spreadsheet -- Enzyme Inhibition Constant Data from BindingDB
Found 1 hit for monomerid = 498083
TargetHistone-binding protein RBBP4/Histone-lysine N-methyltransferase EZH2/Polycomb protein EED [40-441]/Polycomb protein SUZ12(Homo sapiens (Human))
Shanghai Institute Of Material Medica, Chinese Academy Of Sciences
US Patent
LigandPNGBDBM498083(US11013745, Compound E-Y1)
Affinity DataIC50:  18nM. Assay description: The TR-FRET method was used to measure the PRC2 enzyme activity. First, the enzyme was mixed with compounds at different concentrations and incubated...
Ligand InfoPC cidPC sid
In DepthDetails US Patent