BDBM498860 (R)—N-(3-(3-Chlorophenyl)isoxazol-5-yl)-2-(1-cyanopyrrolidin-3-yl)acetamide::US11014912, Example 36
SMILES Clc1cccc(c1)-c1cc(NC(=O)C[C@H]2CCN(C2)C#N)on1
InChI Key InChIKey=DSBRXBQUNFFWBD-LLVKDONJSA-N
Data  1 IC50
  Tab Delimited (TSV)   2D SDfile   Computed 3D by Vconf -m prep SDfile
Find this compound or compounds like it in BindingDB:
Activity Spreadsheet -- Enzyme Inhibition Constant Data from BindingDB
Found 1 hit for monomerid = 498860
TargetUbiquitin carboxyl-terminal hydrolase 30(Homo sapiens (Human))
Mission Therapeutics
US Patent
LigandPNGBDBM498860((R)—N-(3-(3-Chlorophenyl)isoxazol-5-yl)-2-(1-...)
Affinity DataIC50:  5.5nM. Assay description: Dilution plates were prepared at 21 times the final concentration (2100 μM for a final concentration of 100 μM) in 50% DMSO in a 96-well po...
Ligand InfoPC cidPC sid
In DepthDetails US Patent