BDBM498877 US11014912, Example 53
SMILES C[C@H]([C@@H]1CCN(C1)C#N)C(=O)Nc1cc(no1)-c1cccc(Cl)c1
InChI Key InChIKey=MLSIFLHNCUDDIH-DGCLKSJQSA-N
Data  1 IC50
  Tab Delimited (TSV)   2D SDfile   Computed 3D by Vconf -m prep SDfile
Find this compound or compounds like it in BindingDB:
Activity Spreadsheet -- Enzyme Inhibition Constant Data from BindingDB
Found 1 hit for monomerid = 498877
TargetUbiquitin carboxyl-terminal hydrolase 30(Homo sapiens (Human))
Mission Therapeutics
US Patent
LigandPNGBDBM498877(US11014912, Example 53)
Affinity DataIC50:  55nM. Assay description: Dilution plates were prepared at 21 times the final concentration (2100 μM for a final concentration of 100 μM) in 50% DMSO in a 96-well po...
Ligand InfoPC cidPC sid
In DepthDetails US Patent