BDBM498910 N-{(3S,4R)-1-[N~2~- (2-benzyl-2- azaspiro[4.5]dec-8-yl)- N~6~-(methylsulfonyl)- D-lysyl]-3-[(thiophen-2- ylmethyl)carbamoyl]pi- peridin-4-yl}-6- azaspiro[2.5]octane-6- carboxamide::US11014920, Compound 18
SMILES CS(=O)(=O)NCCCC[C@@H](NC1CCC2(CCN(Cc3ccccc3)C2)CC1)C(=O)N1CC[C@@H](NC(=O)N2CCC3(CC3)CC2)[C@H](C1)C(=O)NCc1cccs1
InChI Key InChIKey=DDIKLPJOHIRBAY-LIBHBZCFSA-N
Data  1 IC50
  Tab Delimited (TSV)   2D SDfile   Computed 3D by Vconf -m prep SDfile
Find this compound or compounds like it in BindingDB:
Activity Spreadsheet -- Enzyme Inhibition Constant Data from BindingDB
Found 1 hit for monomerid = 498910
TargetCoagulation factor XII(Homo sapiens (Human))
Merck Sharp & Dohme
US Patent
LigandPNGBDBM498910(N-{(3S,4R)-1-[N~2~- (2-benzyl-2- azaspiro[4.5]dec-...)
Affinity DataIC50:  29.2nM. Assay description: Factor XIIa activity determinations were made in 50 mM HEPES buffer containing 150 mM NaCl, 5 mM CaCl2, and 0.1% PEG 8000 (polyethylene glycol; JT Ba...
Ligand InfoPC cidPC sid
In DepthDetails US Patent