BDBM499144 US11014930, Example 67
SMILES CC1(CC1)n1cc(C(=O)Nc2cc(Br)[nH]n2)c2c(N)ncnc12
InChI Key InChIKey=KFTIUYWZCYZUGD-UHFFFAOYSA-N
Data  1 IC50
  Tab Delimited (TSV)   2D SDfile   Computed 3D by Vconf -m prep SDfile
Find this compound or compounds like it in BindingDB:
Activity Spreadsheet -- Enzyme Inhibition Constant Data from BindingDB
Found 1 hit for monomerid = 499144
TargetProto-oncogene tyrosine-protein kinase receptor Ret(Homo sapiens (Human))
Taiho Pharmaceutical
US Patent
LigandPNGBDBM499144(US11014930, Example 67)
Affinity DataIC50:  0.150nM. Assay description: To measure the inhibitory activity, first, the compounds of the present invention were individually diluted with dimethyl sulfoxide (DMSO) stepwise. ...
Ligand InfoPC cidPC sid
In DepthDetails US Patent