BDBM499329 4-((3-(6- (cyclopropylmethoxy)pyridin-3- yl)phenoxy)methyl)-N-(thiazol-2- ylsulfonyl)benzamide::US11020381, Example 19
SMILES O=C(NS(=O)(=O)c1nccs1)c1ccc(COc2cccc(c2)-c2ccc(OCC3CC3)nc2)cc1
InChI Key InChIKey=ZHGSARYLSZQKEX-UHFFFAOYSA-N
Data  1 IC50
  Tab Delimited (TSV)   2D SDfile   Computed 3D by Vconf -m prep SDfile
Find this compound or compounds like it in BindingDB:
Activity Spreadsheet -- Enzyme Inhibition Constant Data from BindingDB
Found 1 hit for monomerid = 499329
TargetSodium channel protein type 9 subunit alpha(Homo sapiens (Human))
Raqualia Pharma
US Patent
LigandPNGBDBM499329(4-((3-(6- (cyclopropylmethoxy)pyridin-3- yl)phenox...)
Affinity DataIC50: <500nM. Assay description: This screen is used to determine the effects of compounds on human Nav1.7 channels, utilizing electrical field stimulation (EFS) system in 96-well pl...
Ligand InfoPC cidPC sid
In DepthDetails US Patent