BDBM499364 4-((3-(6- (cyclopropylmethoxy)pyridin-3- yl)phenoxy)methyl)-N- ((cyclopropylmethyl)sulfonyl)- 3-fluorobenzamide::US11020381, Example 55
SMILES Fc1cc(ccc1COc1cccc(c1)-c1ccc(OCC2CC2)nc1)C(=O)NS(=O)(=O)CC1CC1
InChI Key InChIKey=HIRARYGHRZFHAE-UHFFFAOYSA-N
Data  1 IC50
  Tab Delimited (TSV)   2D SDfile   Computed 3D by Vconf -m prep SDfile
Find this compound or compounds like it in BindingDB:
Activity Spreadsheet -- Enzyme Inhibition Constant Data from BindingDB
Found 1 hit for monomerid = 499364
TargetSodium channel protein type 9 subunit alpha(Homo sapiens (Human))
Raqualia Pharma
US Patent
LigandPNGBDBM499364(4-((3-(6- (cyclopropylmethoxy)pyridin-3- yl)phenox...)
Affinity DataIC50: <500nM. Assay description: This screen is used to determine the effects of compounds on human Nav1.7 channels, utilizing electrical field stimulation (EFS) system in 96-well pl...
Ligand InfoPC cidPC sid
In DepthDetails US Patent