BDBM499369 4-((3-(5- (cyclopropylmethoxy)pyridin-3- yl)phenoxy)methyl)-N- (methylsulfonyl)benzamide::US11020381, Example 61
SMILES CS(=O)(=O)NC(=O)c1ccc(COc2cccc(c2)-c2cncc(OCC3CC3)c2)cc1
InChI Key InChIKey=HAIYTGSRPHJTPC-UHFFFAOYSA-N
Data  1 IC50
  Tab Delimited (TSV)   2D SDfile   Computed 3D by Vconf -m prep SDfile
Find this compound or compounds like it in BindingDB:
Activity Spreadsheet -- Enzyme Inhibition Constant Data from BindingDB
Found 1 hit for monomerid = 499369
TargetSodium channel protein type 9 subunit alpha(Homo sapiens (Human))
Raqualia Pharma
US Patent
LigandPNGBDBM499369(4-((3-(5- (cyclopropylmethoxy)pyridin-3- yl)phenox...)
Affinity DataIC50: <500nM. Assay description: This screen is used to determine the effects of compounds on human Nav1.7 channels, utilizing electrical field stimulation (EFS) system in 96-well pl...
Ligand InfoPC cidPC sid
In DepthDetails US Patent