BDBM499581 US11020395, Example 177.0::US11020395, Example 178.0
SMILES CO[C@@H]([C@H](C)S(=O)(=O)Nc1nnc([C@H]2C[C@H](C2)C(F)(F)F)n1-c1c(OC)ncnc1OC)c1ncc(Cl)cn1
InChI Key InChIKey=MDCYGUHFBMPNCV-OHTBPHCPSA-N
Data  2 EC50
  Tab Delimited (TSV)   2D SDfile   Computed 3D by Vconf -m prep SDfile
Find this compound or compounds like it in BindingDB:
Activity Spreadsheet -- Enzyme Inhibition Constant Data from BindingDB
Found 2 hits for monomerid = 499581
TargetApelin receptor(Homo sapiens (Human))
Amgen
US Patent
LigandPNGBDBM499581(US11020395, Example 177.0 | US11020395, Example 17...)
Affinity DataEC50:  6.5nM. Assay description: The human APJ receptor was cloned by polymerase chain reaction and the gene encoding the receptor was subcloned in pFLAG-CMV™-3 expression vector (Si...
Ligand InfoPC cidPC sid
In DepthDetails US Patent
TargetApelin receptor(Homo sapiens (Human))
Amgen
US Patent
LigandPNGBDBM499581(US11020395, Example 177.0 | US11020395, Example 17...)
Affinity DataEC50:  23nM. Assay description: The human APJ receptor was cloned by polymerase chain reaction and the gene encoding the receptor was subcloned in pFLAG-CMV™-3 expression vector (Si...
Ligand InfoPC cidPC sid
In DepthDetails US Patent