BDBM499595 US11020395, Example 191.0::US11020395, Example 192.0
SMILES CO[C@@H]([C@H](C)S(=O)(=O)Nc1nnc([C@H]2C[C@H](Cl)C2)n1-c1c(OC)cccc1OC)c1ncc(C)cn1
InChI Key InChIKey=RFLOQUYHBVOORV-ULMVMLMRSA-N
Data  2 EC50
  Tab Delimited (TSV)   2D SDfile   Computed 3D by Vconf -m prep SDfile
Find this compound or compounds like it in BindingDB:
Activity Spreadsheet -- Enzyme Inhibition Constant Data from BindingDB
Found 2 hits for monomerid = 499595
TargetApelin receptor(Homo sapiens (Human))
Amgen
US Patent
LigandPNGBDBM499595(US11020395, Example 191.0 | US11020395, Example 19...)
Affinity DataEC50:  2.90nM. Assay description: The human APJ receptor was cloned by polymerase chain reaction and the gene encoding the receptor was subcloned in pFLAG-CMV™-3 expression vector (Si...
Ligand InfoPC cidPC sid
In DepthDetails US Patent
TargetApelin receptor(Homo sapiens (Human))
Amgen
US Patent
LigandPNGBDBM499595(US11020395, Example 191.0 | US11020395, Example 19...)
Affinity DataEC50:  7.5nM. Assay description: The human APJ receptor was cloned by polymerase chain reaction and the gene encoding the receptor was subcloned in pFLAG-CMV™-3 expression vector (Si...
Ligand InfoPC cidPC sid
In DepthDetails US Patent