BDBM499612 US11020395, Example 210.0
SMILES COc1cccc(OC)c1-n1c(NS(=O)(=O)CCc2ncc(Cl)cn2)nnc1C1CCC1
InChI Key InChIKey=UDUUITJQNVWRTM-UHFFFAOYSA-N
Data  1 EC50
  Tab Delimited (TSV)   2D SDfile   Computed 3D by Vconf -m prep SDfile
Find this compound or compounds like it in BindingDB:
Activity Spreadsheet -- Enzyme Inhibition Constant Data from BindingDB
Found 1 hit for monomerid = 499612
TargetApelin receptor(Homo sapiens (Human))
Amgen
US Patent
LigandPNGBDBM499612(US11020395, Example 210.0)
Affinity DataEC50:  15nM. Assay description: The human APJ receptor was cloned by polymerase chain reaction and the gene encoding the receptor was subcloned in pFLAG-CMV™-3 expression vector (Si...
Ligand InfoPC cidPC sid
In DepthDetails US Patent