BDBM499631 US11020395, Example 229.0::US11020395, Example 230.0
SMILES COc1cccc(OC)c1-n1c(NS(=O)(=O)[C@@H](C)[C@@H](OC(C)C)c2ncc(C)cn2)nnc1[C@@H]1CCC(=O)C1
InChI Key InChIKey=DXMINLVAWVCCFO-YZZKKUAISA-N
Data  2 EC50
  Tab Delimited (TSV)   2D SDfile   Computed 3D by Vconf -m prep SDfile
Find this compound or compounds like it in BindingDB:
Activity Spreadsheet -- Enzyme Inhibition Constant Data from BindingDB
Found 2 hits for monomerid = 499631
TargetApelin receptor(Homo sapiens (Human))
Amgen
US Patent
LigandPNGBDBM499631(US11020395, Example 229.0 | US11020395, Example 23...)
Affinity DataEC50:  190nM. Assay description: The human APJ receptor was cloned by polymerase chain reaction and the gene encoding the receptor was subcloned in pFLAG-CMV™-3 expression vector (Si...
Ligand InfoPC cidPC sid
In DepthDetails US Patent
TargetApelin receptor(Homo sapiens (Human))
Amgen
US Patent
LigandPNGBDBM499631(US11020395, Example 229.0 | US11020395, Example 23...)
Affinity DataEC50:  30nM. Assay description: The human APJ receptor was cloned by polymerase chain reaction and the gene encoding the receptor was subcloned in pFLAG-CMV™-3 expression vector (Si...
Ligand InfoPC cidPC sid
In DepthDetails US Patent