BDBM50000150 CHEMBL440253::Ribonucleotide reductase inhibiting peptide analogue
SMILES CC[C@@H](C)[C@H](NC(=O)[C@@H](NC(=O)[C@@H](NC(=O)CNC(=O)[C@H](C)NC(=O)[C@H](Cc1ccc(O)cc1)NC(=O)[C@H](Cc1ccc(cc1)[N+]([O-])=O)NC(C)=O)[C@@H](C)O)C(C)C)C(=O)N[C@@H](CC(N)=O)C(=O)N[C@@H](CC(O)=O)C(=O)N[C@@H](CC(C)C)C(O)=O
InChI Key InChIKey=OCYPKXUWYBEXJM-FPMIIBKUSA-N
Data  1 IC50
  Tab Delimited (TSV)   2D SDfile   Computed 3D by Vconf -m prep SDfile
Find this compound or compounds like it in BindingDB:
Activity Spreadsheet -- Enzyme Inhibition Constant Data from BindingDB
Found 1 hit for monomerid = 50000150
TargetRibonucleoside-diphosphate reductase large subunit(Homo sapiens (Human))
Notre-Dame Hospital Research
Curated by ChEMBL
LigandPNGBDBM50000150(CHEMBL440253 | Ribonucleotide reductase inhibiting...)
Affinity DataIC50:  1.50E+3nM. Assay description: Inhibitory concentration against HSV-1 ribonucleotide reductase R1 protein binding
In DepthDetails ArticlePubMed