BDBM50000267 2-(3,4-Dichloro-phenyl)-1-(2-dimethylaminomethyl-piperidin-1-yl)-ethanone::2-(3,4-Dichloro-phenyl)-1-(2-dimethylaminomethyl-piperidin-1-yl)-ethanone(HCl)::CHEMBL339552
SMILES CN(C)CC1CCCCN1C(=O)Cc1ccc(Cl)c(Cl)c1
InChI Key InChIKey=PROCBUWEYFCOPD-UHFFFAOYSA-N
Data  2 KI  1 IC50
  Tab Delimited (TSV)   2D SDfile   Computed 3D by Vconf -m prep SDfile
Find this compound or compounds like it in BindingDB:
Activity Spreadsheet -- Enzyme Inhibition Constant Data from BindingDB
Found 3 hits for monomerid = 50000267
TargetKappa-type opioid receptor(Cavia porcellus (domestic guinea pig))
Zambeletti Research Laboratories
Curated by ChEMBL
LigandPNGBDBM50000267(2-(3,4-Dichloro-phenyl)-1-(2-dimethylaminomethyl-p...)
Affinity DataKi:  1.40nM. Assay description: Compound was evaluated for its binding affinity against Opioid receptor kappa 1 subtype in guinea pig brain (minus cerebellum)using [3H]-U-69,593 as ...
In DepthDetails ArticlePubMed
TargetMu-type opioid receptor(GUINEA PIG)
Zambeletti Research Laboratories
Curated by ChEMBL
LigandPNGBDBM50000267(2-(3,4-Dichloro-phenyl)-1-(2-dimethylaminomethyl-p...)
Affinity DataKi:  3.05E+3nM. Assay description: Compound was evaluated for its binding affinity against Opioid receptor mu 1 subtype in guinea pig brain (minus cerebellum) using [3H]-DAGO as radiol...
In DepthDetails ArticlePubMed
TargetKappa-type opioid receptor(Homo sapiens (Human))
Glaxo Group Research
Curated by ChEMBL
LigandPNGBDBM50000267(2-(3,4-Dichloro-phenyl)-1-(2-dimethylaminomethyl-p...)
Affinity DataIC50:  102nM. Assay description: Opioid receptor kappa 1 agonist potency of the compound was determined in vitro using rabbit vas deferens(LVD) preparation
In DepthDetails ArticlePubMed